Uploaded image for project: 'JDK'
  1. JDK
  2. JDK-8265485

javax/sound/midi/Sequencer/Recording.java fails with Test FAILED!

    XMLWordPrintable

Details

    Description

      Creating sequence: 10sec, 120 beats/min, resolution=240 ticks/beat...OK
      Set Sequence to Sequencer. Tempo=120.0
      java.lang.Exception: Sequencer started recording, but is not running!
      ----------System.err:(13/750)----------
      java.lang.Exception: Test FAILED!
      at Recording.main(Recording.java:149)
      at java.base/jdk.internal.reflect.NativeMethodAccessorImpl.invoke0(Native Method)
      at java.base/jdk.internal.reflect.NativeMethodAccessorImpl.invoke(NativeMethodAccessorImpl.java:78)
      at java.base/jdk.internal.reflect.DelegatingMethodAccessorImpl.invoke(DelegatingMethodAccessorImpl.java:43)
      at java.base/java.lang.reflect.Method.invoke(Method.java:568)
      at com.sun.javatest.regtest.agent.MainWrapper$MainThread.run(MainWrapper.java:127)
      at java.base/java.lang.Thread.run(Thread.java:831)

      Attachments

        Activity

          People

            Unassigned Unassigned
            mikael Mikael Vidstedt
            Votes:
            0 Vote for this issue
            Watchers:
            3 Start watching this issue

            Dates

              Created:
              Updated: