Uploaded image for project: 'JDK'
  1. JDK
  2. JDK-6848336

java/awt/event/InputEvent/ModHighBitsTest/ModHighBitsTest.html fails in Jdk7 b60 pit build

    XMLWordPrintable

    Details

    • Subcomponent:
    • Introduced In Version:
      7
    • Resolved In Build:
      b112
    • CPU:
      generic
    • OS:
      generic
    • Verification:
      Not verified

      Description

      Regression testcase java/awt/event/InputEvent/ModHighBitsTest/ModHighBitsTest.html
      fails with the following error on Solaris sparc 10, Rhel5 and Windows XP with Jdk7 b60 pit build.

      "java.lang.RuntimeException: Test failed. Modifier bits were not preserved (was:-559071232 now:-2147483648)
      at ModHighBitsTest.init(ModHighBitsTest.java:27)
      at com.sun.javatest.regtest.AppletWrapper$AppletThread.run(AppletWrapper.java:144)
      at java.lang.Thread.run(Thread.java:717)
      STATUS:Failed.Applet thread threw exception: java.lang.RuntimeException: Test failed. Modifier bits were not preserved (was:-559071232 now:-2147483648)
      result: Failed. Execution failed: Applet thread threw exception: java.lang.RuntimeException: Test failed. Modifier bits were not preserved (was:-559071232 now:-2147483648)"

      Also failed with Jdk7b59. Attached is the .jtr file

        Attachments

          Issue Links

            Activity

              People

              Assignee:
              dav Andrei Dmitriev (Inactive)
              Reporter:
              kpintosunw Karen Pinto (Inactive)
              Votes:
              0 Vote for this issue
              Watchers:
              0 Start watching this issue

                Dates

                Created:
                Updated:
                Resolved:
                Imported:
                Indexed: