Uploaded image for project: 'JDK'
  1. JDK
  2. JDK-8000527

closed/sun/management/snmp/generic/GenericTest.sh fails intermittently

    XMLWordPrintable

    Details

      Backports

        Description

        This test
        closed/sun/management/snmp/generic/GenericTest.sh
        fails with

        Oct 05, 2012 3:17:03 PM SnmpMibValidation
        SEVERE: Snmp error, error [reqTimeout ] index [0]
        Oct 05, 2012 3:17:03 PM SnmpMibValidation
        SEVERE: VALIDATION [JVM MM Tiger 1]. FAILED
        ...
        javax.management.snmp.SnmpStatusException: VALIDATION FAILED, CHECK SEVERE TRACES
        at util.validator.SnmpMibValidator.validate(SnmpMibValidator.java:37)
        at GenericManager.run(GenericManager.java:25)
        at GenericTest.main(GenericTest.java:25)
        Test Failed: VALIDATION FAILED, CHECK SEVERE TRACES
        result: Failed. Execution failed: exit code 20

          Attachments

            Issue Links

              Activity

                People

                Assignee:
                sjiang Shanliang Jiang (Inactive)
                Reporter:
                ekovach Evdokim Kovach (Inactive)
                Votes:
                0 Vote for this issue
                Watchers:
                4 Start watching this issue

                  Dates

                  Created:
                  Updated:
                  Resolved: