Uploaded image for project: 'JDK'
  1. JDK
  2. JDK-8030176

java/rmi/activation/ActivationSystem/stubClassesPermitted/StubClassesPermitted.java fails intermittently

    XMLWordPrintable

    Details

      Description

      TESTFAIL:java/rmi/activation/ActivationSystem/stubClassesPermitted/StubClassesPermitted.java

      java/rmi/activation/ActivationSystem/stubClassesPermitted/StubClassesPermitted.java

      Regression test for bug/rfe 4179055

      RMID: starting rmid on port #50327...
      JAVAVM: command = [/Users/aurora/sandbox/jdk/jre/bin/java, -Djava.security.policy=/Users/aurora/sandbox/testbase/test/java/rmi/activation/ActivationSystem/stubClassesPermitted/rmid.security.policy, -Dsun.rmi.server.activation.debugExec=true, -Dtest.src=/Users/aurora/sandbox/testbase/test/java/rmi/activation/ActivationSystem/stubClassesPermitted, -Dtest.classes=/Users/aurora/sandbox/gresults/testoutput/jdk_rmi/JTwork/classes/java/rmi/activation/ActivationSystem/stubClassesPermitted, -Djava.rmi.server.logLevel=v, -Dsun.rmi.activation.execTimeout=60000, sun.rmi.server.Activation, -log, /Users/aurora/sandbox/gresults/testoutput/jdk_rmi/JTwork/java/rmi/activation/ActivationSystem/stubClassesPermitted/StubClassesPermitted/./log, -port, 50327, -C-Dtest.src=/Users/aurora/sandbox/testbase/test/java/rmi/activation/ActivationSystem/stubClassesPermitted, -C-Dtest.classes=/Users/aurora/sandbox/gresults/testoutput/jdk_rmi/JTwork/classes/java/rmi/activation/ActivationSystem/stubClassesPermitted, -C-Djava.rmi.server.useCodebaseOnly=false]
      ACTIVATION_LIBRARY: Remote connection refused after 0 milliseconds
      ACTIVATION_LIBRARY: Remote connection refused after 100 milliseconds
      ACTIVATION_LIBRARY: Remote connection refused after 200 milliseconds
      ACTIVATION_LIBRARY: Remote connection refused after 300 milliseconds
      ACTIVATION_LIBRARY: Remote connection refused after 400 milliseconds
      ACTIVATION_LIBRARY: Activation System available after 500 milliseconds
      RMID: finished starting rmid.
      Create activation group, in a new VM
      TEST FAILED:
      Test failed with: null
      java.lang.NullPointerException
      at StubClassesPermitted.main(StubClassesPermitted.java:114)
      at sun.reflect.NativeMethodAccessorImpl.invoke0(Native Method)
      at sun.reflect.NativeMethodAccessorImpl.invoke(NativeMethodAccessorImpl.java:62)
      at sun.reflect.DelegatingMethodAccessorImpl.invoke(DelegatingMethodAccessorImpl.java:43)
      at java.lang.reflect.Method.invoke(Method.java:483)
      at com.sun.javatest.regtest.MainWrapper$MainThread.run(MainWrapper.java:94)
      at java.lang.Thread.run(Thread.java:744)
      ACTIVATION_LIBRARY: Activation System available after 0 milliseconds
      RMID: getting a reference to the activation system
      RMID: obtained a reference to the activation system
      RMID: testlibrary finished shutting down rmid
      activation daemon shut down
      RMID: RMID's process still not terminated after more than 200 milliseconds
      RMID: RMID's process still not terminated after more than 400 milliseconds
      RMID: RMID's process still not terminated after more than 600 milliseconds
      RMID: rmid exited on shutdown request
      ACTIVATION_LIBRARY: finished destroying rmid
      RMID: removing rmid's old log file...
      rmid shut down
      TestFailedException: TEST FAILED: ; nested exception is:
      java.lang.NullPointerException
      java.lang.NullPointerException
      at StubClassesPermitted.main(StubClassesPermitted.java:114)
      at sun.reflect.NativeMethodAccessorImpl.invoke0(Native Method)
      at sun.reflect.NativeMethodAccessorImpl.invoke(NativeMethodAccessorImpl.java:62)
      at sun.reflect.DelegatingMethodAccessorImpl.invoke(DelegatingMethodAccessorImpl.java:43)
      at java.lang.reflect.Method.invoke(Method.java:483)
      at com.sun.javatest.regtest.MainWrapper$MainThread.run(MainWrapper.java:94)
      at java.lang.Thread.run(Thread.java:744)

      JavaTest Message: Test threw exception: TestFailedException: TEST FAILED: ; nested exception is:
      java.lang.NullPointerException
      JavaTest Message: shutting down test

      STATUS:Failed.`main' threw exception: TestFailedException: TEST FAILED: ; nested exception is: java.lang.NullPointerException

        Attachments

          Issue Links

            Activity

              People

              Assignee:
              smarks Stuart Marks
              Reporter:
              ewang Eric Wang (Inactive)
              Votes:
              0 Vote for this issue
              Watchers:
              2 Start watching this issue

                Dates

                Created:
                Updated:
                Resolved: