Uploaded image for project: 'JDK'
  1. JDK
  2. JDK-8050115

[TEST_BUG] javax/management/monitor/GaugeMonitorDeadlockTest.java fails intermittently

    XMLWordPrintable

    Details

    • Type: Bug
    • Status: Resolved
    • Priority: P4
    • Resolution: Fixed
    • Affects Version/s: 7u101, 9
    • Fix Version/s: 9
    • Component/s: core-svc
    • Subcomponent:
    • Resolved In Build:
      b32
    • CPU:
      generic
    • OS:
      generic

      Backports

        Description

        The test
          javax/management/monitor/GaugeMonitorDeadlockTest.java

        failed in the 2014-07-11 RT_Baseline nightly with

        ----------System.err:(14/832)----------
        java.lang.Exception: Test failed: presumable deadlock
        at GaugeMonitorDeadlockTest$TestCase.run(GaugeMonitorDeadlockTest.java:110)
        at GaugeMonitorDeadlockTest.main(GaugeMonitorDeadlockTest.java:57)
        at sun.reflect.NativeMethodAccessorImpl.invoke0(Native Method)
        at sun.reflect.NativeMethodAccessorImpl.invoke(NativeMethodAccessorImpl.java:62)
        at sun.reflect.DelegatingMethodAccessorImpl.invoke(DelegatingMethodAccessorImpl.java:43)
        at java.lang.reflect.Method.invoke(Method.java:484)
        at com.sun.javatest.regtest.MainWrapper$MainThread.run(MainWrapper.java:94)
        at java.lang.Thread.run(Thread.java:745)

        JavaTest Message: Test threw exception: java.lang.Exception: Test failed: presumable deadlock
        JavaTest Message: shutting down test

        STATUS:Failed.`main' threw exception: java.lang.Exception: Test failed: presumable deadlock

          Attachments

            Issue Links

              Activity

                People

                Assignee:
                sjiang Shanliang Jiang (Inactive)
                Reporter:
                sspitsyn Serguei Spitsyn
                Votes:
                0 Vote for this issue
                Watchers:
                6 Start watching this issue

                  Dates

                  Created:
                  Updated:
                  Resolved: