Uploaded image for project: 'JDK'
  1. JDK
  2. JDK-8158106

native/GTestWrapper.java gets SIGABRT

    XMLWordPrintable

    Details

    • Subcomponent:
    • Resolved In Build:
      b122

      Description

      ----------System.out:(33/1486)----------
      Command line: [/export/home/aurora/sandbox/JTREG_NATIVEPATH_LIBRARY_PREPARED/server/gtestLauncher -jdk /export/home/aurora/CommonData/TEST_JAVA_HOME -Xmixed -XX:MaxRAMFraction=8 -XX:+CreateCoredumpOnCrash -XX:+IgnoreUnrecognizedVMOptions -XX:+UseG1GC]
      [==========] Running 3 tests from 2 test cases.
      [----------] Global test environment set-up.
      [----------] 2 tests from os
      [ RUN ] os.page_size_for_region_test_vm
      [ OK ] os.page_size_for_region_test_vm (0 ms)
      [ RUN ] os.page_size_for_region_with_zero_min_pages_vm_assert_test
      Current thread is 58233
      Dumping core ...
      /scratch/opt/jprt/T/P1/193427.artem/s/hotspot/test/native/runtime/test_os.cpp:41: Failure
      Death test: child_os_page_size_for_region_with_zero_min_pages_()
          Result: died but not with expected exit code:
                  Terminated by signal 6 (core dumped)
      Actual msg:
      [ DEATH ] assert failed: sanity
      [ DEATH ]
      [ FAILED ] os.page_size_for_region_with_zero_min_pages_vm_assert_test (1320 ms)
      [----------] 2 tests from os (1320 ms total)

      [----------] 1 test from utilities
      [ RUN ] utilities.quicksort_test
      [ OK ] utilities.quicksort_test (0 ms)
      [----------] 1 test from utilities (0 ms total)

      [----------] Global test environment tear-down
      [==========] 3 tests from 2 test cases ran. (1320 ms total)
      [ PASSED ] 2 tests.
      [ FAILED ] 1 test, listed below:
      [ FAILED ] os.page_size_for_region_with_zero_min_pages_vm_assert_test

       1 FAILED TEST

        Attachments

          Activity

            People

            Assignee:
            ctornqvi Christian Tornqvist
            Reporter:
            jprovino Joseph Provino (Inactive)
            Votes:
            0 Vote for this issue
            Watchers:
            5 Start watching this issue

              Dates

              Created:
              Updated:
              Resolved: