Uploaded image for project: 'JDK'
  1. JDK
  2. JDK-8160388

Test Case Failure in CallBackTest

    XMLWordPrintable

    Details

    • Type: Bug
    • Status: Resolved
    • Priority: P3
    • Resolution: Fixed
    • Affects Version/s: 8u112, 9
    • Fix Version/s: 9
    • Component/s: javafx
    • Labels:
    • Subcomponent:
      web

      Backports

        Description

        There is one failure observed while running webengine unit test cases.

        test.javafx.scene.web.CallbackTest > testDialogs FAILED
            java.lang.AssertionError: Method onAlert was not called with args: Favorite color?,
                at org.junit.Assert.fail(Assert.java:91)
                at test.javafx.scene.web.CallbackTest$TestUI.checkCalled(CallbackTest.java:266)
                at test.javafx.scene.web.CallbackTest.testDialogs(CallbackTest.java:187)

        370 tests completed, 1 failed, 11 skipped
        :web:test FAILED

          Attachments

            Issue Links

              Activity

                People

                Assignee:
                mbilla Murali Billa
                Reporter:
                mbilla Murali Billa
                Votes:
                0 Vote for this issue
                Watchers:
                2 Start watching this issue

                  Dates

                  Created:
                  Updated:
                  Resolved: