Uploaded image for project: 'JDK'
  1. JDK
  2. JDK-8202886

[macos] Test java/awt/MenuBar/8007006/bug8007006.java fails on MacOS

    XMLWordPrintable

    Details

    • Subcomponent:
    • Resolved In Build:
      b20

      Backports

        Description

        java/awt/MenuBar/8007006/bug8007006.java fails repeatably on MacOS 10.12

        ----------System.out:(0/0)----------
        ----------System.err:(13/832)----------
        java.lang.Exception: Test failed: menu item remained checked
        at bug8007006.main(bug8007006.java:91)
        at java.base/jdk.internal.reflect.NativeMethodAccessorImpl.invoke0(Native Method)
        at java.base/jdk.internal.reflect.NativeMethodAccessorImpl.invoke(NativeMethodAccessorImpl.java:62)
        at java.base/jdk.internal.reflect.DelegatingMethodAccessorImpl.invoke(DelegatingMethodAccessorImpl.java:43)
        at java.base/java.lang.reflect.Method.invoke(Method.java:569)
        at com.sun.javatest.regtest.agent.MainWrapper$MainThread.run(MainWrapper.java:115)
        at java.base/java.lang.Thread.run(Thread.java:832)

        JavaTest Message: Test threw exception: java.lang.Exception: Test failed: menu item remained checked
        JavaTest Message: shutting down test

        STATUS:Failed.`main' threw exception: java.lang.Exception: Test failed: menu item remained checked

          Attachments

            Issue Links

              Activity

                People

                Assignee:
                serb Sergey Bylokhov
                Reporter:
                prr Philip Race
                Votes:
                0 Vote for this issue
                Watchers:
                7 Start watching this issue

                  Dates

                  Created:
                  Updated:
                  Resolved: