Uploaded image for project: 'JDK'
  1. JDK
  2. JDK-8202932

java/awt/Component/NativeInLightShow/NativeInLightShow.java fails

    XMLWordPrintable

Details

    • Bug
    • Status: Resolved
    • P4
    • Resolution: Fixed
    • 10, 11
    • 18
    • client-libs
    • b21

    Description

      java/awt/Component/NativeInLightShow/NativeInLightShow.java fails on Linux

      Test FAILED
      ----------System.err:(13/816)----------
      java.lang.RuntimeException: Button was not pressed
      at NativeInLightShow.main(NativeInLightShow.java:89)
      at java.base/jdk.internal.reflect.NativeMethodAccessorImpl.invoke0(Native Method)
      at java.base/jdk.internal.reflect.NativeMethodAccessorImpl.invoke(NativeMethodAccessorImpl.java:62)
      at java.base/jdk.internal.reflect.DelegatingMethodAccessorImpl.invoke(DelegatingMethodAccessorImpl.java:43)
      at java.base/java.lang.reflect.Method.invoke(Method.java:569)
      at com.sun.javatest.regtest.agent.MainWrapper$MainThread.run(MainWrapper.java:115)
      at java.base/java.lang.Thread.run(Thread.java:832)

      JavaTest Message: Test threw exception: java.lang.RuntimeException: Button was not pressed
      JavaTest Message: shutting down test

      STATUS:Failed.`main' threw exception: java.lang.RuntimeException: Button was not pressed
      ----------rerun:(23/1514)*----------

      Attachments

        Issue Links

          Activity

            People

              azvegint Alexander Zvegintsev
              prr Philip Race
              Votes:
              0 Vote for this issue
              Watchers:
              6 Start watching this issue

              Dates

                Created:
                Updated:
                Resolved: