Uploaded image for project: 'JDK'
  1. JDK
  2. JDK-8252551

JDK-8250630 causes build error on Win*

    XMLWordPrintable

    Details

    • Type: Bug
    • Status: Resolved
    • Priority: P2
    • Resolution: Fixed
    • Affects Version/s: 16
    • Fix Version/s: 16
    • Component/s: core-svc
    • Labels:
    • Subcomponent:
    • Resolved In Build:
      b14
    • CPU:
      x86_64
    • OS:
      windows

      Description

      The following fix was pushed in jdk-16+14-556, but the fix
      appears to cause a build error on Windows:

      [2020-08-30T15:22:05,060Z] Creating support/native/java.base/libnio/static/nio.lib from 18 file(s)
      [2020-08-30T15:22:06,701Z] t:/workspace/open/src/jdk.jdwp.agent/share/native/libdt_socket/socketTransport.c(719): error C2220: the following warning is treated as an error
      [2020-08-30T15:22:06,701Z] t:/workspace/open/src/jdk.jdwp.agent/share/native/libdt_socket/socketTransport.c(719): warning C4101: 'pass': unreferenced local variable
      [2020-08-30T15:22:06,717Z] modules/jdk.jdwp.agent/Lib.gmk:30: recipe for target '/cygdrive/t/workspace/build/windows-x64-debug/support/native/jdk.jdwp.agent/libdt_socket/static/socketTransport.obj' failed
      [2020-08-30T15:22:06,717Z] make[3]: *** [/cygdrive/t/workspace/build/windows-x64-debug/support/native/jdk.jdwp.agent/libdt_socket/static/socketTransport.obj] Error 1
      [2020-08-30T15:22:06,717Z] make[3]: *** Waiting for unfinished jobs....
      [2020-08-30T15:22:07,889Z] Compiling 74 files for jdk.crypto.cryptoki
      [2020-08-30T15:22:08,013Z] Compiling 409 files for jdk.compiler
      [2020-08-30T15:22:08,276Z] Creating support/native/jdk.internal.le/lible/static/le.lib from 1 file(s)
      [2020-08-30T15:22:09,436Z] make/Main.gmk:216: recipe for target 'jdk.jdwp.agent-static-libs' failed
      [2020-08-30T15:22:09,436Z] make[2]: *** [jdk.jdwp.agent-static-libs] Error 2
      [2020-08-30T15:22:09,436Z] make[2]: *** Waiting for unfinished jobs....
      [2020-08-30T15:22:09,702Z] Compiling 197 files for java.naming
      [2020-08-30T15:24:12,728Z] make[2]: INTERNAL: Exiting with 13 jobserver tokens available; should be 16!
      [2020-08-30T15:24:12,774Z]
      [2020-08-30T15:24:12,774Z] ERROR: Build failed for target 'default (product-bundles test-bundles static-libs-bundles)' in configuration 'windows-x64-debug' (exit code 2)
      [2020-08-30T15:24:12,900Z] Stopping sjavac server

        Attachments

          Issue Links

            Activity

              People

              Assignee:
              dsamersoff Dmitriy Samersoff
              Reporter:
              dcubed Daniel Daugherty
              Votes:
              0 Vote for this issue
              Watchers:
              2 Start watching this issue

                Dates

                Created:
                Updated:
                Resolved: