Uploaded image for project: 'JDK'
  1. JDK
  2. JDK-8284531

tools/jpackage/macosx/DmgContentTest.java failed "DmgContentTest(0, MAC_DMG" subtest

    XMLWordPrintable

    Details

    • Type: Bug
    • Status: Closed
    • Priority: P3
    • Resolution: Duplicate
    • Affects Version/s: 19
    • Fix Version/s: None
    • Component/s: tools
    • Subcomponent:
    • CPU:
      aarch64
    • OS:
      os_x

      Description

      The following test failed in the JDK19 CI:

      tools/jpackage/macosx/DmgContentTest.java

      Here's a snippet from the log file:

      [10:02:26.041] [ RUN ] DmgContentTest(0, MAC_DMG, [/System/Volumes/Data/mesos/work_dir/jib-master/install/jdk-19+18-1147/src.full/open/test/jdk/tools/jpackage/apps/PrintEnv.java, /System/Volumes/Data/mesos/work_dir/jib-master/install/jdk-19+18-1147/src.full/open/test/jdk/tools/jpackage/apps/dukeplug.png](length=2)).test
      [10:02:26.057] TRACE: Actions: [[initialize], [create], [unpack], [verify-install], [finalize]]
      [10:02:26.074] TRACE: exec: Execute tool provider [javac -d ./test.2e765dc8/jar-workdir /System/Volumes/Data/mesos/work_dir/jib-master/install/jdk-19+18-1147/src.full/open/test/jdk/tools/jpackage/apps/Hello.java](4)...
      [10:02:26.675] TRACE: exec: Done. Exit code: 0
      [10:02:26.675] TRACE: assertEquals(0): Check command tool provider [javac -d ./test.2e765dc8/jar-workdir /System/Volumes/Data/mesos/work_dir/jib-master/install/jdk-19+18-1147/src.full/open/test/jdk/tools/jpackage/apps/Hello.java](4) exited with 0 code
      [10:02:26.679] TRACE: exec: Execute tool provider [jar -c -f ./test.2e765dc8/input/hello.jar -C ./test.2e765dc8/jar-workdir .](7)...
      [10:02:26.722] TRACE: exec: Done. Exit code: 0
      [10:02:26.722] TRACE: assertEquals(0): Check command tool provider [jar -c -f ./test.2e765dc8/input/hello.jar -C ./test.2e765dc8/jar-workdir .](7) exited with 0 code
      [10:02:26.728] TRACE: exec: Execute [/System/Volumes/Data/mesos/work_dir/jib-master/install/jdk-19+18-1147/macosx-aarch64.jdk/jdk-19.jdk/Contents/Home/bin/jpackage --input ./test.2e765dc8/input --dest ./test.2e765dc8/output --name DmgContentTest --type dmg --main-jar hello.jar --main-class Hello --mac-dmg-content /System/Volumes/Data/mesos/work_dir/jib-master/install/jdk-19+18-1147/src.full/open/test/jdk/tools/jpackage/apps/PrintEnv.java --mac-dmg-content /System/Volumes/Data/mesos/work_dir/jib-master/install/jdk-19+18-1147/src.full/open/test/jdk/tools/jpackage/apps/dukeplug.png -J-Djlink.debug=true --verbose](19); inherit I/O...
      [10:02:26.897] Building DMG package for DmgContentTest.
      [10:02:31.452] Command [PID: -1]:
          jlink --output /var/folders/fp/ydkyr8y1705g2rckf50_bxd40000gp/T/jdk.jpackage6445277135272625130/images/image-8172727308830845904/DmgContentTest.app/Contents/runtime/Contents/Home --module-path /System/Volumes/Data/mesos/work_dir/jib-master/install/jdk-19+18-1147/macosx-aarch64.jdk/jdk-19.jdk/Contents/Home/jmods --add-modules jdk.management.jfr,java.rmi,jdk.jdi,jdk.charsets,java.xml,jdk.xml.dom,java.datatransfer,jdk.jstatd,jdk.httpserver,java.desktop,java.security.sasl,jdk.zipfs,java.base,jdk.crypto.ec,jdk.javadoc,jdk.management.agent,jdk.jshell,jdk.editpad,java.sql.rowset,jdk.jsobject,jdk.sctp,java.smartcardio,jdk.unsupported,jdk.jlink,java.security.jgss,java.compiler,jdk.nio.mapmode,jdk.dynalink,jdk.unsupported.desktop,jdk.accessibility,jdk.security.jgss,java.sql,jdk.incubator.vector,java.transaction.xa,java.xml.crypto,java.logging,jdk.jfr,jdk.crypto.cryptoki,jdk.random,jdk.net,java.naming,jdk.internal.ed,java.prefs,java.net.http,jdk.compiler,jdk.naming.rmi,jdk.internal.opt,jdk.jconsole,jdk.attach,jdk.internal.le,java.management,jdk.jdwp.agent,jdk.internal.jvmstat,jdk.incubator.foreign,java.instrument,jdk.management,jdk.security.auth,java.scripting,jdk.jdeps,jdk.jartool,java.management.rmi,jdk.jpackage,jdk.naming.dns,jdk.localedata --strip-native-commands --strip-debug --no-man-pages --no-header-files
      [10:02:31.452] Output:
          WARNING: Using incubator modules: jdk.incubator.vector, jdk.incubator.foreign
      Error: java.lang.IllegalArgumentException
      java.io.IOException: java.lang.IllegalArgumentException
      at jdk.jlink/jdk.tools.jlink.internal.ImageFileCreator.generateJImage(ImageFileCreator.java:194)
      at jdk.jlink/jdk.tools.jlink.internal.ImageFileCreator.writeImage(ImageFileCreator.java:163)
      at jdk.jlink/jdk.tools.jlink.internal.ImageFileCreator.create(ImageFileCreator.java:100)
      at jdk.jlink/jdk.tools.jlink.internal.JlinkTask$ImageHelper.retrieve(JlinkTask.java:871)
      at jdk.jlink/jdk.tools.jlink.internal.ImagePluginStack.operate(ImagePluginStack.java:194)
      at jdk.jlink/jdk.tools.jlink.internal.JlinkTask.createImage(JlinkTask.java:436)
      at jdk.jlink/jdk.tools.jlink.internal.JlinkTask.run(JlinkTask.java:276)
      at jdk.jlink/jdk.tools.jlink.internal.Main.run(Main.java:55)
      at jdk.jlink/jdk.tools.jlink.internal.Main$JlinkToolProvider.run(Main.java:66)
      at jdk.jpackage/jdk.jpackage.internal.JLinkBundlerHelper.runJLink(JLinkBundlerHelper.java:191)
      at jdk.jpackage/jdk.jpackage.internal.JLinkBundlerHelper.execute(JLinkBundlerHelper.java:81)
      at jdk.jpackage/jdk.jpackage.internal.AppImageBundler.createAppBundle(AppImageBundler.java:166)
      at jdk.jpackage/jdk.jpackage.internal.AppImageBundler.execute(AppImageBundler.java:91)
      at jdk.jpackage/jdk.jpackage.internal.MacBaseInstallerBundler.prepareAppBundle(MacBaseInstallerBundler.java:167)
      at jdk.jpackage/jdk.jpackage.internal.MacDmgBundler.bundle(MacDmgBundler.java:82)
      at jdk.jpackage/jdk.jpackage.internal.MacDmgBundler.execute(MacDmgBundler.java:579)
      at jdk.jpackage/jdk.jpackage.internal.Arguments.generateBundle(Arguments.java:689)
      at jdk.jpackage/jdk.jpackage.internal.Arguments.processArguments(Arguments.java:561)
      at jdk.jpackage/jdk.jpackage.main.Main.execute(Main.java:91)
      at jdk.jpackage/jdk.jpackage.main.Main.main(Main.java:52)
      Caused by: java.lang.IllegalArgumentException
      at java.base/jdk.internal.org.objectweb.asm.ClassReader.<init>(ClassReader.java:294)
      at java.base/jdk.internal.org.objectweb.asm.ClassReader.<init>(ClassReader.java:212)
      at java.base/jdk.internal.org.objectweb.asm.ClassReader.<init>(ClassReader.java:198)
      at jdk.jlink/jdk.tools.jlink.internal.plugins.AbstractPlugin.newClassReader(AbstractPlugin.java:90)
      at jdk.jlink/jdk.tools.jlink.internal.plugins.StripJavaDebugAttributesPlugin.lambda$transform$1(StripJavaDebugAttributesPlugin.java:62)
      at jdk.jlink/jdk.tools.jlink.plugin.ResourcePool.lambda$transformAndCopy$0(ResourcePool.java:112)
      at java.base/java.util.Iterator.forEachRemaining(Iterator.java:133)
      at java.base/java.util.Spliterators$IteratorSpliterator.forEachRemaining(Spliterators.java:1845)
      at java.base/java.util.stream.ReferencePipeline$Head.forEach(ReferencePipeline.java:762)
      at jdk.jlink/jdk.tools.jlink.plugin.ResourcePool.transformAndCopy(ResourcePool.java:111)
      at jdk.jlink/jdk.tools.jlink.internal.plugins.StripJavaDebugAttributesPlugin.transform(StripJavaDebugAttributesPlugin.java:54)
      at jdk.jlink/jdk.tools.jlink.internal.plugins.DefaultStripDebugPlugin.transform(DefaultStripDebugPlugin.java:76)
      at jdk.jlink/jdk.tools.jlink.internal.ImagePluginStack.visitResources(ImagePluginStack.java:262)
      at jdk.jlink/jdk.tools.jlink.internal.ImageFileCreator.generateJImage(ImageFileCreator.java:184)
      ... 19 more

      [10:02:31.452] Returned: 1

      [10:02:31.452] jdk.jpackage.internal.PackagerException: jlink failed with: WARNING: Using incubator modules: jdk.incubator.vector, jdk.incubator.foreign
      Error: java.lang.IllegalArgumentException
      java.io.IOException: java.lang.IllegalArgumentException
      at jdk.jlink/jdk.tools.jlink.internal.ImageFileCreator.generateJImage(ImageFileCreator.java:194)
      at jdk.jlink/jdk.tools.jlink.internal.ImageFileCreator.writeImage(ImageFileCreator.java:163)
      at jdk.jlink/jdk.tools.jlink.internal.ImageFileCreator.create(ImageFileCreator.java:100)
      at jdk.jlink/jdk.tools.jlink.internal.JlinkTask$ImageHelper.retrieve(JlinkTask.java:871)
      at jdk.jlink/jdk.tools.jlink.internal.ImagePluginStack.operate(ImagePluginStack.java:194)
      at jdk.jlink/jdk.tools.jlink.internal.JlinkTask.createImage(JlinkTask.java:436)
      at jdk.jlink/jdk.tools.jlink.internal.JlinkTask.run(JlinkTask.java:276)
      at jdk.jlink/jdk.tools.jlink.internal.Main.run(Main.java:55)
      at jdk.jlink/jdk.tools.jlink.internal.Main$JlinkToolProvider.run(Main.java:66)
      at jdk.jpackage/jdk.jpackage.internal.JLinkBundlerHelper.runJLink(JLinkBundlerHelper.java:191)
      at jdk.jpackage/jdk.jpackage.internal.JLinkBundlerHelper.execute(JLinkBundlerHelper.java:81)
      at jdk.jpackage/jdk.jpackage.internal.AppImageBundler.createAppBundle(AppImageBundler.java:166)
      at jdk.jpackage/jdk.jpackage.internal.AppImageBundler.execute(AppImageBundler.java:91)
      at jdk.jpackage/jdk.jpackage.internal.MacBaseInstallerBundler.prepareAppBundle(MacBaseInstallerBundler.java:167)
      at jdk.jpackage/jdk.jpackage.internal.MacDmgBundler.bundle(MacDmgBundler.java:82)
      at jdk.jpackage/jdk.jpackage.internal.MacDmgBundler.execute(MacDmgBundler.java:579)
      at jdk.jpackage/jdk.jpackage.internal.Arguments.generateBundle(Arguments.java:689)
      at jdk.jpackage/jdk.jpackage.internal.Arguments.processArguments(Arguments.java:561)
      at jdk.jpackage/jdk.jpackage.main.Main.execute(Main.java:91)
      at jdk.jpackage/jdk.jpackage.main.Main.main(Main.java:52)
      Caused by: java.lang.IllegalArgumentException
      at java.base/jdk.internal.org.objectweb.asm.ClassReader.<init>(ClassReader.java:294)
      at java.base/jdk.internal.org.objectweb.asm.ClassReader.<init>(ClassReader.java:212)
      at java.base/jdk.internal.org.objectweb.asm.ClassReader.<init>(ClassReader.java:198)
      at jdk.jlink/jdk.tools.jlink.internal.plugins.AbstractPlugin.newClassReader(AbstractPlugin.java:90)
      at jdk.jlink/jdk.tools.jlink.internal.plugins.StripJavaDebugAttributesPlugin.lambda$transform$1(StripJavaDebugAttributesPlugin.java:62)
      at jdk.jlink/jdk.tools.jlink.plugin.ResourcePool.lambda$transformAndCopy$0(ResourcePool.java:112)
      at java.base/java.util.Iterator.forEachRemaining(Iterator.java:133)
      at java.base/java.util.Spliterators$IteratorSpliterator.forEachRemaining(Spliterators.java:1845)
      at java.base/java.util.stream.ReferencePipeline$Head.forEach(ReferencePipeline.java:762)
      at jdk.jlink/jdk.tools.jlink.plugin.ResourcePool.transformAndCopy(ResourcePool.java:111)
      at jdk.jlink/jdk.tools.jlink.internal.plugins.StripJavaDebugAttributesPlugin.transform(StripJavaDebugAttributesPlugin.java:54)
      at jdk.jlink/jdk.tools.jlink.internal.plugins.DefaultStripDebugPlugin.transform(DefaultStripDebugPlugin.java:76)
      at jdk.jlink/jdk.tools.jlink.internal.ImagePluginStack.visitResources(ImagePluginStack.java:262)
      at jdk.jlink/jdk.tools.jlink.internal.ImageFileCreator.generateJImage(ImageFileCreator.java:184)
      ... 19 more

      at jdk.jpackage/jdk.jpackage.internal.JLinkBundlerHelper.runJLink(JLinkBundlerHelper.java:199)
      at jdk.jpackage/jdk.jpackage.internal.JLinkBundlerHelper.execute(JLinkBundlerHelper.java:81)
      at jdk.jpackage/jdk.jpackage.internal.AppImageBundler.createAppBundle(AppImageBundler.java:166)
      at jdk.jpackage/jdk.jpackage.internal.AppImageBundler.execute(AppImageBundler.java:91)
      at jdk.jpackage/jdk.jpackage.internal.MacBaseInstallerBundler.prepareAppBundle(MacBaseInstallerBundler.java:167)
      at jdk.jpackage/jdk.jpackage.internal.MacDmgBundler.bundle(MacDmgBundler.java:82)
      at jdk.jpackage/jdk.jpackage.internal.MacDmgBundler.execute(MacDmgBundler.java:579)
      at jdk.jpackage/jdk.jpackage.internal.Arguments.generateBundle(Arguments.java:689)
      at jdk.jpackage/jdk.jpackage.internal.Arguments.processArguments(Arguments.java:561)
      at jdk.jpackage/jdk.jpackage.main.Main.execute(Main.java:91)
      at jdk.jpackage/jdk.jpackage.main.Main.main(Main.java:52)
      [10:02:31.453] jdk.jpackage.internal.PackagerException: jdk.jpackage.internal.PackagerException: jlink failed with: WARNING: Using incubator modules: jdk.incubator.vector, jdk.incubator.foreign
      Error: java.lang.IllegalArgumentException
      java.io.IOException: java.lang.IllegalArgumentException
      at jdk.jlink/jdk.tools.jlink.internal.ImageFileCreator.generateJImage(ImageFileCreator.java:194)
      at jdk.jlink/jdk.tools.jlink.internal.ImageFileCreator.writeImage(ImageFileCreator.java:163)
      at jdk.jlink/jdk.tools.jlink.internal.ImageFileCreator.create(ImageFileCreator.java:100)
      at jdk.jlink/jdk.tools.jlink.internal.JlinkTask$ImageHelper.retrieve(JlinkTask.java:871)
      at jdk.jlink/jdk.tools.jlink.internal.ImagePluginStack.operate(ImagePluginStack.java:194)
      at jdk.jlink/jdk.tools.jlink.internal.JlinkTask.createImage(JlinkTask.java:436)
      at jdk.jlink/jdk.tools.jlink.internal.JlinkTask.run(JlinkTask.java:276)
      at jdk.jlink/jdk.tools.jlink.internal.Main.run(Main.java:55)
      at jdk.jlink/jdk.tools.jlink.internal.Main$JlinkToolProvider.run(Main.java:66)
      at jdk.jpackage/jdk.jpackage.internal.JLinkBundlerHelper.runJLink(JLinkBundlerHelper.java:191)
      at jdk.jpackage/jdk.jpackage.internal.JLinkBundlerHelper.execute(JLinkBundlerHelper.java:81)
      at jdk.jpackage/jdk.jpackage.internal.AppImageBundler.createAppBundle(AppImageBundler.java:166)
      at jdk.jpackage/jdk.jpackage.internal.AppImageBundler.execute(AppImageBundler.java:91)
      at jdk.jpackage/jdk.jpackage.internal.MacBaseInstallerBundler.prepareAppBundle(MacBaseInstallerBundler.java:167)
      at jdk.jpackage/jdk.jpackage.internal.MacDmgBundler.bundle(MacDmgBundler.java:82)
      at jdk.jpackage/jdk.jpackage.internal.MacDmgBundler.execute(MacDmgBundler.java:579)
      at jdk.jpackage/jdk.jpackage.internal.Arguments.generateBundle(Arguments.java:689)
      at jdk.jpackage/jdk.jpackage.internal.Arguments.processArguments(Arguments.java:561)
      at jdk.jpackage/jdk.jpackage.main.Main.execute(Main.java:91)
      at jdk.jpackage/jdk.jpackage.main.Main.main(Main.java:52)
      Caused by: java.lang.IllegalArgumentException
      at java.base/jdk.internal.org.objectweb.asm.ClassReader.<init>(ClassReader.java:294)
      at java.base/jdk.internal.org.objectweb.asm.ClassReader.<init>(ClassReader.java:212)
      at java.base/jdk.internal.org.objectweb.asm.ClassReader.<init>(ClassReader.java:198)
      at jdk.jlink/jdk.tools.jlink.internal.plugins.AbstractPlugin.newClassReader(AbstractPlugin.java:90)
      at jdk.jlink/jdk.tools.jlink.internal.plugins.StripJavaDebugAttributesPlugin.lambda$transform$1(StripJavaDebugAttributesPlugin.java:62)
      at jdk.jlink/jdk.tools.jlink.plugin.ResourcePool.lambda$transformAndCopy$0(ResourcePool.java:112)
      at java.base/java.util.Iterator.forEachRemaining(Iterator.java:133)
      at java.base/java.util.Spliterators$IteratorSpliterator.forEachRemaining(Spliterators.java:1845)
      at java.base/java.util.stream.ReferencePipeline$Head.forEach(ReferencePipeline.java:762)
      at jdk.jlink/jdk.tools.jlink.plugin.ResourcePool.transformAndCopy(ResourcePool.java:111)
      at jdk.jlink/jdk.tools.jlink.internal.plugins.StripJavaDebugAttributesPlugin.transform(StripJavaDebugAttributesPlugin.java:54)
      at jdk.jlink/jdk.tools.jlink.internal.plugins.DefaultStripDebugPlugin.transform(DefaultStripDebugPlugin.java:76)
      at jdk.jlink/jdk.tools.jlink.internal.ImagePluginStack.visitResources(ImagePluginStack.java:262)
      at jdk.jlink/jdk.tools.jlink.internal.ImageFileCreator.generateJImage(ImageFileCreator.java:184)
      ... 19 more

      at jdk.jpackage/jdk.jpackage.internal.MacDmgBundler.bundle(MacDmgBundler.java:95)
      at jdk.jpackage/jdk.jpackage.internal.MacDmgBundler.execute(MacDmgBundler.java:579)
      at jdk.jpackage/jdk.jpackage.internal.Arguments.generateBundle(Arguments.java:689)
      at jdk.jpackage/jdk.jpackage.internal.Arguments.processArguments(Arguments.java:561)
      at jdk.jpackage/jdk.jpackage.main.Main.execute(Main.java:91)
      at jdk.jpackage/jdk.jpackage.main.Main.main(Main.java:52)
      Caused by: jdk.jpackage.internal.PackagerException: jlink failed with: WARNING: Using incubator modules: jdk.incubator.vector, jdk.incubator.foreign
      Error: java.lang.IllegalArgumentException
      java.io.IOException: java.lang.IllegalArgumentException
      at jdk.jlink/jdk.tools.jlink.internal.ImageFileCreator.generateJImage(ImageFileCreator.java:194)
      at jdk.jlink/jdk.tools.jlink.internal.ImageFileCreator.writeImage(ImageFileCreator.java:163)
      at jdk.jlink/jdk.tools.jlink.internal.ImageFileCreator.create(ImageFileCreator.java:100)
      at jdk.jlink/jdk.tools.jlink.internal.JlinkTask$ImageHelper.retrieve(JlinkTask.java:871)
      at jdk.jlink/jdk.tools.jlink.internal.ImagePluginStack.operate(ImagePluginStack.java:194)
      at jdk.jlink/jdk.tools.jlink.internal.JlinkTask.createImage(JlinkTask.java:436)
      at jdk.jlink/jdk.tools.jlink.internal.JlinkTask.run(JlinkTask.java:276)
      at jdk.jlink/jdk.tools.jlink.internal.Main.run(Main.java:55)
      at jdk.jlink/jdk.tools.jlink.internal.Main$JlinkToolProvider.run(Main.java:66)
      at jdk.jpackage/jdk.jpackage.internal.JLinkBundlerHelper.runJLink(JLinkBundlerHelper.java:191)
      at jdk.jpackage/jdk.jpackage.internal.JLinkBundlerHelper.execute(JLinkBundlerHelper.java:81)
      at jdk.jpackage/jdk.jpackage.internal.AppImageBundler.createAppBundle(AppImageBundler.java:166)
      at jdk.jpackage/jdk.jpackage.internal.AppImageBundler.execute(AppImageBundler.java:91)
      at jdk.jpackage/jdk.jpackage.internal.MacBaseInstallerBundler.prepareAppBundle(MacBaseInstallerBundler.java:167)
      at jdk.jpackage/jdk.jpackage.internal.MacDmgBundler.bundle(MacDmgBundler.java:82)
      at jdk.jpackage/jdk.jpackage.internal.MacDmgBundler.execute(MacDmgBundler.java:579)
      at jdk.jpackage/jdk.jpackage.internal.Arguments.generateBundle(Arguments.java:689)
      at jdk.jpackage/jdk.jpackage.internal.Arguments.processArguments(Arguments.java:561)
      at jdk.jpackage/jdk.jpackage.main.Main.execute(Main.java:91)
      at jdk.jpackage/jdk.jpackage.main.Main.main(Main.java:52)
      Caused by: java.lang.IllegalArgumentException
      at java.base/jdk.internal.org.objectweb.asm.ClassReader.<init>(ClassReader.java:294)
      at java.base/jdk.internal.org.objectweb.asm.ClassReader.<init>(ClassReader.java:212)
      at java.base/jdk.internal.org.objectweb.asm.ClassReader.<init>(ClassReader.java:198)
      at jdk.jlink/jdk.tools.jlink.internal.plugins.AbstractPlugin.newClassReader(AbstractPlugin.java:90)
      at jdk.jlink/jdk.tools.jlink.internal.plugins.StripJavaDebugAttributesPlugin.lambda$transform$1(StripJavaDebugAttributesPlugin.java:62)
      at jdk.jlink/jdk.tools.jlink.plugin.ResourcePool.lambda$transformAndCopy$0(ResourcePool.java:112)
      at java.base/java.util.Iterator.forEachRemaining(Iterator.java:133)
      at java.base/java.util.Spliterators$IteratorSpliterator.forEachRemaining(Spliterators.java:1845)
      at java.base/java.util.stream.ReferencePipeline$Head.forEach(ReferencePipeline.java:762)
      at jdk.jlink/jdk.tools.jlink.plugin.ResourcePool.transformAndCopy(ResourcePool.java:111)
      at jdk.jlink/jdk.tools.jlink.internal.plugins.StripJavaDebugAttributesPlugin.transform(StripJavaDebugAttributesPlugin.java:54)
      at jdk.jlink/jdk.tools.jlink.internal.plugins.DefaultStripDebugPlugin.transform(DefaultStripDebugPlugin.java:76)
      at jdk.jlink/jdk.tools.jlink.internal.ImagePluginStack.visitResources(ImagePluginStack.java:262)
      at jdk.jlink/jdk.tools.jlink.internal.ImageFileCreator.generateJImage(ImageFileCreator.java:184)
      ... 19 more

      at jdk.jpackage/jdk.jpackage.internal.JLinkBundlerHelper.runJLink(JLinkBundlerHelper.java:199)
      at jdk.jpackage/jdk.jpackage.internal.JLinkBundlerHelper.execute(JLinkBundlerHelper.java:81)
      at jdk.jpackage/jdk.jpackage.internal.AppImageBundler.createAppBundle(AppImageBundler.java:166)
      at jdk.jpackage/jdk.jpackage.internal.AppImageBundler.execute(AppImageBundler.java:91)
      at jdk.jpackage/jdk.jpackage.internal.MacBaseInstallerBundler.prepareAppBundle(MacBaseInstallerBundler.java:167)
      at jdk.jpackage/jdk.jpackage.internal.MacDmgBundler.bundle(MacDmgBundler.java:82)
      ... 5 more
      [10:02:31.467] TRACE: exec: Done. Exit code: 1
      [10:02:31.467] ERROR: Expected [0]. Actual [1]: Check command [/System/Volumes/Data/mesos/work_dir/jib-master/install/jdk-19+18-1147/macosx-aarch64.jdk/jdk-19.jdk/Contents/Home/bin/jpackage --input ./test.2e765dc8/input --dest ./test.2e765dc8/output --name DmgContentTest --type dmg --main-jar hello.jar --main-class Hello --mac-dmg-content /System/Volumes/Data/mesos/work_dir/jib-master/install/jdk-19+18-1147/src.full/open/test/jdk/tools/jpackage/apps/PrintEnv.java --mac-dmg-content /System/Volumes/Data/mesos/work_dir/jib-master/install/jdk-19+18-1147/src.full/open/test/jdk/tools/jpackage/apps/dukeplug.png -J-Djlink.debug=true --verbose](19) exited with 0 code
      [10:02:31.468] [ FAILED ] DmgContentTest(0, MAC_DMG, [/System/Volumes/Data/mesos/work_dir/jib-master/install/jdk-19+18-1147/src.full/open/test/jdk/tools/jpackage/apps/PrintEnv.java, /System/Volumes/Data/mesos/work_dir/jib-master/install/jdk-19+18-1147/src.full/open/test/jdk/tools/jpackage/apps/dukeplug.png](length=2)).test; checks=3

      Starting this bug off as a P3 since this is a Tier2 test failure.

        Attachments

          Issue Links

            Activity

              People

              Assignee:
              Unassigned Unassigned
              Reporter:
              dcubed Daniel Daugherty
              Votes:
              0 Vote for this issue
              Watchers:
              3 Start watching this issue

                Dates

                Created:
                Updated:
                Resolved: