Uploaded image for project: 'JDK'
  1. JDK
  2. JDK-8285647

serviceability/sa/ClhsdbFindPC.java#no-xcomp-core failed with "RuntimeException: 'Java_jdk_test_lib_apps_LingeredApp_crash' missing"

    XMLWordPrintable

    Details

      Description

      The following test failed in the JDK19 CI:

      serviceability/sa/ClhsdbFindPC.java#no-xcomp-core

      Here's a snippet from the log file:

      ----------System.err:(28/1387)----------
       stdout: [ +
      ];
       stderr: [ +
      ]
       exitValue = -1

      java.lang.RuntimeException: Test ERROR java.lang.RuntimeException: 'Java_jdk_test_lib_apps_LingeredApp_crash' missing from stdout/stderr

      at ClhsdbFindPC.testFindPC(ClhsdbFindPC.java:306)
      at ClhsdbFindPC.main(ClhsdbFindPC.java:328)
      at java.base/jdk.internal.reflect.DirectMethodHandleAccessor.invoke(DirectMethodHandleAccessor.java:104)
      at java.base/java.lang.reflect.Method.invoke(Method.java:578)
      at com.sun.javatest.regtest.agent.MainWrapper$MainThread.run(MainWrapper.java:127)
      at java.base/java.lang.Thread.run(Thread.java:828)
      Caused by: java.lang.RuntimeException: 'Java_jdk_test_lib_apps_LingeredApp_crash' missing from stdout/stderr

      at jdk.test.lib.process.OutputAnalyzer.shouldMatch(OutputAnalyzer.java:340)
      at ClhsdbLauncher.runCmd(ClhsdbLauncher.java:166)
      at ClhsdbLauncher.runOnCore(ClhsdbLauncher.java:225)
      at ClhsdbFindPC.runTest(ClhsdbFindPC.java:318)
      at ClhsdbFindPC.testFindPC(ClhsdbFindPC.java:129)
      ... 5 more

      JavaTest Message: Test threw exception: java.lang.RuntimeException: Test ERROR java.lang.RuntimeException: 'Java_jdk_test_lib_apps_LingeredApp_crash' missing from stdout/stderr

      JavaTest Message: shutting down test

      STATUS:Failed.`main' threw exception: java.lang.RuntimeException: Test ERROR java.lang.RuntimeException: 'Java_jdk_test_lib_apps_LingeredApp_crash' missing from stdout/stderr
      ----------rerun:(33/6700)*----------


      The stdout log does show this:

      # Java VM: Java HotSpot(TM) 64-Bit Server VM (fastdebug 19-ea+20-1343, interpreted mode, sharing, compressed oops, compressed class ptrs, g1 gc, linux-aarch64)
      # Problematic frame:
      # C [libLingeredApp.so+0x73c] Java_jdk_test_lib_apps_LingeredApp_crash+0xc
      #

      and "Java_jdk_test_lib_apps_LingeredApp_crash" appears to be
      what's being looked for.

        Attachments

          Issue Links

            Activity

              People

              Assignee:
              cjplummer Chris Plummer
              Reporter:
              dcubed Daniel Daugherty
              Votes:
              0 Vote for this issue
              Watchers:
              2 Start watching this issue

                Dates

                Created:
                Updated: