http://release-misc:8080/hudson/job/javatest5.0-build/508/console
http://release-misc:8080/hudson/job/javatest5.0-build/507/console
doc.impl:
doc:
init-jtlite:
[mkdir] Created dir: /net/scanas412.us.oracle.com/export/java_re2/misc/nightly/javatest/javatest5.0/ws/b20/BUILD/lite-area
compile-detector:
[mkdir] Created dir: /net/scanas412.us.oracle.com/export/java_re2/misc/nightly/javatest/javatest5.0/ws/b20/BUILD/lite-area/detector_cls
[javac] /net/scanas412.us.oracle.com/export/java_re2/misc/nightly/javatest/javatest5.0/ws/b20/build/javatest_lite.xml:111: warning: 'includeantruntime' was not set, defaulting to build.sysclasspath=last; set to false for repeatable builds
[javac] Compiling 1 source file to /net/scanas412.us.oracle.com/export/java_re2/misc/nightly/javatest/javatest5.0/ws/b20/BUILD/lite-area/detector_cls
lite:
[mkdir] Created dir: /net/scanas412.us.oracle.com/export/java_re2/misc/nightly/javatest/javatest5.0/ws/b20/BUILD/lite-area/classes
[unzip] Expanding: /net/scanas412.us.oracle.com/export/java_re2/misc/nightly/javatest/javatest5.0/ws/b20/BUILD/binaries/lib/javatest.jar into /net/scanas412.us.oracle.com/export/java_re2/misc/nightly/javatest/javatest5.0/ws/b20/BUILD/lite-area/classes
[javac] /net/scanas412.us.oracle.com/export/java_re2/misc/nightly/javatest/javatest5.0/ws/b20/build/javatest_lite.xml:17: warning: 'includeantruntime' was not set, defaulting to build.sysclasspath=last; set to false for repeatable builds
[javac] Compiling 1 source file to /net/scanas412.us.oracle.com/export/java_re2/misc/nightly/javatest/javatest5.0/ws/b20/BUILD/lite-area/classes
[javac] Note: /net/scanas412.us.oracle.com/export/java_re2/misc/nightly/javatest/javatest5.0/ws/b20/BUILD/jtharness/build/jtlite/extra/Main.java uses unchecked or unsafe operations.
[javac] Note: Recompile with -Xlint:unchecked for details.
[java] count 601
[copy] Copying 1 file to /net/scanas412.us.oracle.com/export/java_re2/misc/nightly/javatest/javatest5.0/ws/b20/BUILD/lite-area/classes/META-INF/services
[jar] Building jar: /net/scanas412.us.oracle.com/export/java_re2/misc/nightly/javatest/javatest5.0/ws/b20/BUILD/temp/signing/unsigned/jtlite.jar
[jar] Building jar: /net/scanas412.us.oracle.com/export/java_re2/misc/nightly/javatest/javatest5.0/ws/b20/BUILD/temp/signing/signed/jtlite.jar
[java] From CLIENT CLIENT REQUEST:java.net.ConnectException: Connection refused
[copy] Copying 1 file to /net/scanas412.us.oracle.com/export/java_re2/misc/nightly/javatest/javatest5.0/ws/b20/BUILD/temp/jt-internal-only/lib
[copy] Copying 1 file to /net/scanas412.us.oracle.com/export/java_re2/misc/nightly/javatest/javatest5.0/ws/b20/BUILD/binaries/lib
[copy] Copying 1 file to /net/scanas412.us.oracle.com/export/java_re2/misc/nightly/javatest/javatest5.0/ws/b20/BUILD/temp/jtarch/lib
[copy] Copying 1 file to /net/scanas412.us.oracle.com/export/java_re2/misc/nightly/javatest/javatest5.0/ws/b20/BUILD/temp/jtarch/redistributables/javatest/lib
build:
pack.jtarch.zip:
[copy] Copying 1 file to /net/scanas412.us.oracle.com/export/java_re2/misc/nightly/javatest/javatest5.0/ws/b20/BUILD/temp/jtarch/lib
[mkdir] Created dir: /net/scanas412.us.oracle.com/export/java_re2/misc/nightly/javatest/javatest5.0/ws/b20/BUILD/temp/jtarch/linux/bin
[copy] Copying 1 file to /net/scanas412.us.oracle.com/export/java_re2/misc/nightly/javatest/javatest5.0/ws/b20/BUILD/temp/jtarch/linux/bin
[mkdir] Created dir: /net/scanas412.us.oracle.com/export/java_re2/misc/nightly/javatest/javatest5.0/ws/b20/BUILD/temp/jtarch/win32/bin
[copy] Copying 1 file to /net/scanas412.us.oracle.com/export/java_re2/misc/nightly/javatest/javatest5.0/ws/b20/BUILD/temp/jtarch/win32/bin
[mkdir] Created dir: /net/scanas412.us.oracle.com/export/java_re2/misc/nightly/javatest/javatest5.0/ws/b20/BUILD/temp/jtarch/solaris/bin
[copy] Copying 1 file to /net/scanas412.us.oracle.com/export/java_re2/misc/nightly/javatest/javatest5.0/ws/b20/BUILD/temp/jtarch/solaris/bin
[copy] Copying 1 file to /net/scanas412.us.oracle.com/export/java_re2/misc/nightly/javatest/javatest5.0/ws/b20/BUILD/temp/jtarch/doc
[copy] Copying 7 files to /net/scanas412.us.oracle.com/export/java_re2/misc/nightly/javatest/javatest5.0/ws/b20/BUILD/temp/jtarch/doc/javatest/shared
[copy] Copying 4 files to /net/scanas412.us.oracle.com/export/java_re2/misc/nightly/javatest/javatest5.0/ws/b20/BUILD/temp/jtarch/doc/javatest
[mkdir] Created dir: /net/scanas412.us.oracle.com/export/java_re2/misc/nightly/javatest/javatest5.0/ws/b20/BUILD/temp/jtarch/doc/javatest/UserGuide
[copy] Copying 357 files to /net/scanas412.us.oracle.com/export/java_re2/misc/nightly/javatest/javatest5.0/ws/b20/BUILD/temp/jtarch/doc/javatest/UserGuide
[copy] Copying 1 file to /net/scanas412.us.oracle.com/export/java_re2/misc/nightly/javatest/javatest5.0/ws/b20/BUILD/temp/jtarch/doc/javatest/UserGuide
[copy] Copying 1 file to /net/scanas412.us.oracle.com/export/java_re2/misc/nightly/javatest/javatest5.0/ws/b20/BUILD/temp/jtarch/doc/javatest/UserGuide
[copy] Copying 1 file to /net/scanas412.us.oracle.com/export/java_re2/misc/nightly/javatest/javatest5.0/ws/b20/BUILD/temp/jtarch/doc/javatest/UserGuide
[replace] Replaced 151 occurrences in 1 files.
[replace] Replaced 10 occurrences in 1 files.
[mkdir] Created dir: /net/scanas412.us.oracle.com/export/java_re2/misc/nightly/javatest/javatest5.0/ws/b20/BUILD/temp/jtarch/doc/javatest/UserGuide/shared
[copy] Copying 7 files to /net/scanas412.us.oracle.com/export/java_re2/misc/nightly/javatest/javatest5.0/ws/b20/BUILD/temp/jtarch/doc/javatest/UserGuide/shared
[copy] Copying 1 file to /net/scanas412.us.oracle.com/export/java_re2/misc/nightly/javatest/javatest5.0/ws/b20/BUILD/temp/jtarch/doc/javatest/UserGuide
[mkdir] Created dir: /net/scanas412.us.oracle.com/export/java_re2/misc/nightly/javatest/javatest5.0/ws/b20/BUILD/temp/jtarch/doc/javatest/AgentUserGuide
[copy] Copying 1 file to /net/scanas412.us.oracle.com/export/java_re2/misc/nightly/javatest/javatest5.0/ws/b20/BUILD/temp/jtarch/doc/javatest/AgentUserGuide
[copy] Copying 73 files to /net/scanas412.us.oracle.com/export/java_re2/misc/nightly/javatest/javatest5.0/ws/b20/BUILD/temp/jtarch/doc/javatest/AgentUserGuide
BUILD FAILED
/net/scanas412.us.oracle.com/export/java_re2/misc/nightly/javatest/javatest5.0/ws/b20/build/javatest_pack.xml:595: Warning: Could not find file /net/scanas412.us.oracle.com/export/java_re2/misc/nightly/javatest/javatest5.0/ws/b20/src/doc/javatest/AgentUserGuide.html to copy.
http://release-misc:8080/hudson/job/javatest5.0-build/507/console
doc.impl:
doc:
init-jtlite:
[mkdir] Created dir: /net/scanas412.us.oracle.com/export/java_re2/misc/nightly/javatest/javatest5.0/ws/b20/BUILD/lite-area
compile-detector:
[mkdir] Created dir: /net/scanas412.us.oracle.com/export/java_re2/misc/nightly/javatest/javatest5.0/ws/b20/BUILD/lite-area/detector_cls
[javac] /net/scanas412.us.oracle.com/export/java_re2/misc/nightly/javatest/javatest5.0/ws/b20/build/javatest_lite.xml:111: warning: 'includeantruntime' was not set, defaulting to build.sysclasspath=last; set to false for repeatable builds
[javac] Compiling 1 source file to /net/scanas412.us.oracle.com/export/java_re2/misc/nightly/javatest/javatest5.0/ws/b20/BUILD/lite-area/detector_cls
lite:
[mkdir] Created dir: /net/scanas412.us.oracle.com/export/java_re2/misc/nightly/javatest/javatest5.0/ws/b20/BUILD/lite-area/classes
[unzip] Expanding: /net/scanas412.us.oracle.com/export/java_re2/misc/nightly/javatest/javatest5.0/ws/b20/BUILD/binaries/lib/javatest.jar into /net/scanas412.us.oracle.com/export/java_re2/misc/nightly/javatest/javatest5.0/ws/b20/BUILD/lite-area/classes
[javac] /net/scanas412.us.oracle.com/export/java_re2/misc/nightly/javatest/javatest5.0/ws/b20/build/javatest_lite.xml:17: warning: 'includeantruntime' was not set, defaulting to build.sysclasspath=last; set to false for repeatable builds
[javac] Compiling 1 source file to /net/scanas412.us.oracle.com/export/java_re2/misc/nightly/javatest/javatest5.0/ws/b20/BUILD/lite-area/classes
[javac] Note: /net/scanas412.us.oracle.com/export/java_re2/misc/nightly/javatest/javatest5.0/ws/b20/BUILD/jtharness/build/jtlite/extra/Main.java uses unchecked or unsafe operations.
[javac] Note: Recompile with -Xlint:unchecked for details.
[java] count 601
[copy] Copying 1 file to /net/scanas412.us.oracle.com/export/java_re2/misc/nightly/javatest/javatest5.0/ws/b20/BUILD/lite-area/classes/META-INF/services
[jar] Building jar: /net/scanas412.us.oracle.com/export/java_re2/misc/nightly/javatest/javatest5.0/ws/b20/BUILD/temp/signing/unsigned/jtlite.jar
[jar] Building jar: /net/scanas412.us.oracle.com/export/java_re2/misc/nightly/javatest/javatest5.0/ws/b20/BUILD/temp/signing/signed/jtlite.jar
[java] From CLIENT CLIENT REQUEST:java.net.ConnectException: Connection refused
[copy] Copying 1 file to /net/scanas412.us.oracle.com/export/java_re2/misc/nightly/javatest/javatest5.0/ws/b20/BUILD/temp/jt-internal-only/lib
[copy] Copying 1 file to /net/scanas412.us.oracle.com/export/java_re2/misc/nightly/javatest/javatest5.0/ws/b20/BUILD/binaries/lib
[copy] Copying 1 file to /net/scanas412.us.oracle.com/export/java_re2/misc/nightly/javatest/javatest5.0/ws/b20/BUILD/temp/jtarch/lib
[copy] Copying 1 file to /net/scanas412.us.oracle.com/export/java_re2/misc/nightly/javatest/javatest5.0/ws/b20/BUILD/temp/jtarch/redistributables/javatest/lib
build:
pack.jtarch.zip:
[copy] Copying 1 file to /net/scanas412.us.oracle.com/export/java_re2/misc/nightly/javatest/javatest5.0/ws/b20/BUILD/temp/jtarch/lib
[mkdir] Created dir: /net/scanas412.us.oracle.com/export/java_re2/misc/nightly/javatest/javatest5.0/ws/b20/BUILD/temp/jtarch/linux/bin
[copy] Copying 1 file to /net/scanas412.us.oracle.com/export/java_re2/misc/nightly/javatest/javatest5.0/ws/b20/BUILD/temp/jtarch/linux/bin
[mkdir] Created dir: /net/scanas412.us.oracle.com/export/java_re2/misc/nightly/javatest/javatest5.0/ws/b20/BUILD/temp/jtarch/win32/bin
[copy] Copying 1 file to /net/scanas412.us.oracle.com/export/java_re2/misc/nightly/javatest/javatest5.0/ws/b20/BUILD/temp/jtarch/win32/bin
[mkdir] Created dir: /net/scanas412.us.oracle.com/export/java_re2/misc/nightly/javatest/javatest5.0/ws/b20/BUILD/temp/jtarch/solaris/bin
[copy] Copying 1 file to /net/scanas412.us.oracle.com/export/java_re2/misc/nightly/javatest/javatest5.0/ws/b20/BUILD/temp/jtarch/solaris/bin
[copy] Copying 1 file to /net/scanas412.us.oracle.com/export/java_re2/misc/nightly/javatest/javatest5.0/ws/b20/BUILD/temp/jtarch/doc
[copy] Copying 7 files to /net/scanas412.us.oracle.com/export/java_re2/misc/nightly/javatest/javatest5.0/ws/b20/BUILD/temp/jtarch/doc/javatest/shared
[copy] Copying 4 files to /net/scanas412.us.oracle.com/export/java_re2/misc/nightly/javatest/javatest5.0/ws/b20/BUILD/temp/jtarch/doc/javatest
[mkdir] Created dir: /net/scanas412.us.oracle.com/export/java_re2/misc/nightly/javatest/javatest5.0/ws/b20/BUILD/temp/jtarch/doc/javatest/UserGuide
[copy] Copying 357 files to /net/scanas412.us.oracle.com/export/java_re2/misc/nightly/javatest/javatest5.0/ws/b20/BUILD/temp/jtarch/doc/javatest/UserGuide
[copy] Copying 1 file to /net/scanas412.us.oracle.com/export/java_re2/misc/nightly/javatest/javatest5.0/ws/b20/BUILD/temp/jtarch/doc/javatest/UserGuide
[copy] Copying 1 file to /net/scanas412.us.oracle.com/export/java_re2/misc/nightly/javatest/javatest5.0/ws/b20/BUILD/temp/jtarch/doc/javatest/UserGuide
[copy] Copying 1 file to /net/scanas412.us.oracle.com/export/java_re2/misc/nightly/javatest/javatest5.0/ws/b20/BUILD/temp/jtarch/doc/javatest/UserGuide
[replace] Replaced 151 occurrences in 1 files.
[replace] Replaced 10 occurrences in 1 files.
[mkdir] Created dir: /net/scanas412.us.oracle.com/export/java_re2/misc/nightly/javatest/javatest5.0/ws/b20/BUILD/temp/jtarch/doc/javatest/UserGuide/shared
[copy] Copying 7 files to /net/scanas412.us.oracle.com/export/java_re2/misc/nightly/javatest/javatest5.0/ws/b20/BUILD/temp/jtarch/doc/javatest/UserGuide/shared
[copy] Copying 1 file to /net/scanas412.us.oracle.com/export/java_re2/misc/nightly/javatest/javatest5.0/ws/b20/BUILD/temp/jtarch/doc/javatest/UserGuide
[mkdir] Created dir: /net/scanas412.us.oracle.com/export/java_re2/misc/nightly/javatest/javatest5.0/ws/b20/BUILD/temp/jtarch/doc/javatest/AgentUserGuide
[copy] Copying 1 file to /net/scanas412.us.oracle.com/export/java_re2/misc/nightly/javatest/javatest5.0/ws/b20/BUILD/temp/jtarch/doc/javatest/AgentUserGuide
[copy] Copying 73 files to /net/scanas412.us.oracle.com/export/java_re2/misc/nightly/javatest/javatest5.0/ws/b20/BUILD/temp/jtarch/doc/javatest/AgentUserGuide
BUILD FAILED
/net/scanas412.us.oracle.com/export/java_re2/misc/nightly/javatest/javatest5.0/ws/b20/build/javatest_pack.xml:595: Warning: Could not find file /net/scanas412.us.oracle.com/export/java_re2/misc/nightly/javatest/javatest5.0/ws/b20/src/doc/javatest/AgentUserGuide.html to copy.