Issue | Fix Version | Assignee | Priority | Status | Resolution | Resolved In Build |
---|---|---|---|---|---|---|
JDK-2028251 | 1.4.0 | Pat Cashman | P3 | Resolved | Fixed | merlin |
JDK-2028249 | 1.3.1 | Pat Cashman | P3 | Resolved | Fixed | 1.3.1 |
JDK-2028250 | 1.3.0 | Pat Cashman | P3 | Resolved | Fixed | linux-rc1 |
From ###@###.### Fri Jul 23 16:27:00 1999
Date: Thu, 22 Jul 1999 18:00:05 -0700 (PDT)
From: "Venkateswara Maddileti [TEMP]" <###@###.###>
To: ###@###.###
Subject: Exception in java-compiler
numake classes VARIANT=DBG
gnumake[3]: Entering directory `/home/venkat/kestrel/build/solaris/java/jar'
rm -f .classes.list
if [ -s .classes.list ] ; then ../../bin/javac_g -J-Xms32m -J-Xmx64m -J-Xmaxf1 -classpath ../../classes
-bootclasspath "" -sourcepath
../../../../src/solaris/classes:../../../../src/share/classes -d ../../classes
; fi
gnumake[3]: Leaving directory `/home/venkat/kestrel/build/solaris/java/jar'
gnumake[2]: Leaving directory `/home/venkat/kestrel/build/solaris/java/jar'
<<<Finished Recursively making jar all @ Thu Jul 22 17:57:27 PDT 1999.
>>>Recursively making beans all @ Thu Jul 22 17:57:27 PDT 1999 ...
gnumake[2]: Entering directory `/home/venkat/kestrel/build/solaris/java/beans'
gnumake classes VARIANT=OPT
gnumake[3]: Entering directory `/home/venkat/kestrel/build/solaris/java/beans'
rm -f .classes.list
if [ -s .classes.list ] ; then ../../bin/javac -J-Xms32m -J-Xmx64m -J-Xmaxf1 -classpath ../../classes
-bootclasspath "" -sourcepath
../../../../src/solaris/classes:../../../../src/share/classes -d ../../classes
../../../../src/share/classes/java/beans/PropertyDescriptor.java ; fi
An exception has occurred in the compiler. (v0.8)
Please file a bug report by sending your program and the following diagnostic to
###@###.###
Thank you.
java.lang.InternalError: writePool com.sun.tools.javac.v8.comp.Env@c9f1d583
at com.sun.tools.javac.v8.code.ClassWriter.writePool(ClassWriter.java,
Compiled Code)
at
com.sun.tools.javac.v8.code.ClassWriter.writeClassFile(ClassWriter.java,
Compiled Code)
at com.sun.tools.javac.v8.JavaCompiler.writeClass(JavaCompiler.java,
Compiled Code)
at com.sun.tools.javac.v8.JavaCompiler.genCode(JavaCompiler.java,
Compiled Code)
at com.sun.tools.javac.v8.JavaCompiler.compile(JavaCompiler.java,
Compiled Code)
at com.sun.tools.javac.v8.Main.compile(Main.java, Compiled Code)
at com.sun.tools.javac.Main.main(Main.java, Compiled Code)
gnumake[3]: *** [.compile.classlist] Error 4
gnumake[3]: Leaving directory `/home/venkat/kestrel/build/solaris/java/beans'
gnumake[2]: *** [optimized] Error 2
gnumake[2]: Leaving directory `/home/venkat/kestrel/build/solaris/java/beans'
gnumake[1]: *** [all] Error 1
gnumake[1]: Leaving directory `/home/venkat/kestrel/build/solaris/java'
gnumake: *** [all] Error 1
Date: Thu, 22 Jul 1999 18:00:05 -0700 (PDT)
From: "Venkateswara Maddileti [TEMP]" <###@###.###>
To: ###@###.###
Subject: Exception in java-compiler
numake classes VARIANT=DBG
gnumake[3]: Entering directory `/home/venkat/kestrel/build/solaris/java/jar'
rm -f .classes.list
if [ -s .classes.list ] ; then ../../bin/javac_g -J-Xms32m -J-Xmx64m -J-Xmaxf1 -classpath ../../classes
-bootclasspath "" -sourcepath
../../../../src/solaris/classes:../../../../src/share/classes -d ../../classes
; fi
gnumake[3]: Leaving directory `/home/venkat/kestrel/build/solaris/java/jar'
gnumake[2]: Leaving directory `/home/venkat/kestrel/build/solaris/java/jar'
<<<Finished Recursively making jar all @ Thu Jul 22 17:57:27 PDT 1999.
>>>Recursively making beans all @ Thu Jul 22 17:57:27 PDT 1999 ...
gnumake[2]: Entering directory `/home/venkat/kestrel/build/solaris/java/beans'
gnumake classes VARIANT=OPT
gnumake[3]: Entering directory `/home/venkat/kestrel/build/solaris/java/beans'
rm -f .classes.list
if [ -s .classes.list ] ; then ../../bin/javac -J-Xms32m -J-Xmx64m -J-Xmaxf1 -classpath ../../classes
-bootclasspath "" -sourcepath
../../../../src/solaris/classes:../../../../src/share/classes -d ../../classes
../../../../src/share/classes/java/beans/PropertyDescriptor.java ; fi
An exception has occurred in the compiler. (v0.8)
Please file a bug report by sending your program and the following diagnostic to
###@###.###
Thank you.
java.lang.InternalError: writePool com.sun.tools.javac.v8.comp.Env@c9f1d583
at com.sun.tools.javac.v8.code.ClassWriter.writePool(ClassWriter.java,
Compiled Code)
at
com.sun.tools.javac.v8.code.ClassWriter.writeClassFile(ClassWriter.java,
Compiled Code)
at com.sun.tools.javac.v8.JavaCompiler.writeClass(JavaCompiler.java,
Compiled Code)
at com.sun.tools.javac.v8.JavaCompiler.genCode(JavaCompiler.java,
Compiled Code)
at com.sun.tools.javac.v8.JavaCompiler.compile(JavaCompiler.java,
Compiled Code)
at com.sun.tools.javac.v8.Main.compile(Main.java, Compiled Code)
at com.sun.tools.javac.Main.main(Main.java, Compiled Code)
gnumake[3]: *** [.compile.classlist] Error 4
gnumake[3]: Leaving directory `/home/venkat/kestrel/build/solaris/java/beans'
gnumake[2]: *** [optimized] Error 2
gnumake[2]: Leaving directory `/home/venkat/kestrel/build/solaris/java/beans'
gnumake[1]: *** [all] Error 1
gnumake[1]: Leaving directory `/home/venkat/kestrel/build/solaris/java'
gnumake: *** [all] Error 1
- backported by
-
JDK-2028249 Compiler crash in incremental build
-
- Resolved
-
-
JDK-2028250 Compiler crash in incremental build
-
- Resolved
-
-
JDK-2028251 Compiler crash in incremental build
-
- Resolved
-