-
Bug
-
Resolution: Fixed
-
P4
-
1.4.0
-
beta
-
generic, x86, sparc
-
generic, solaris_2.6, windows_nt
therJVMCmd CLASSPATH=$testSuiteRootDir/../classes$:$javatestClassDir DISPLAY=$DISPLAY HOME=${user.home} LD_LIBRARY_PATH=$testSuiteRootDir/../lib /usr/local/java/jdk1.4/solaris/bin/java -Xfuture -Djava.security.policy=$testSuiteRootDir/../lib/jck.policy -Djava.rmi.activation.port=${java.rmi.activation.port} $testExecuteClass $testExecuteArgs
| java.rmi.activation.port=57599
| user.home=/home/dixonj
|
| #-----testresult-----
| description=file:///java/jck-dev/users3/dixonj/merlin-cup-build/unzip/JCK-runtime-14/tests/api/java_awt/GridBagLayout/serial/index.html#Input
| end=Sat Jun 24 06:31:13 PDT 2000
| environment=jck-runtime-solaris
| execStatus=Failed. tests: 1; failed: 1; first test case failure: serial2002
| javatestOS=SunOS 5.7 (sparc)
| javatestVersion=JT_2.1.3h
| script=javasoft.sqe.javatest.lib.JCKScript -runtime
| sections=script_messages testExecute
| start=Sat Jun 24 06:31:10 PDT 2000
| status=Failed. tests: 1; failed: 1; first test case failure: serial2002
| test=api/java_awt/GridBagLayout/serial/index.html#Input
| timeoutSeconds=600
| work=/java/jck-dev/users3/dixonj/merlin-cup-build/test/JCK-runtime-14/runtime-batch-multiJVM-jit-native/work/api/java_awt/GridBagLayout/serial
|
| #section:script_messages
| ----------messages:(1/24)----------
| Executing test class...
|
| #section:testExecute
| ----------messages:(1/627)----------
| command: javasoft.sqe.javatest.lib.ExecJCKTestOtherJVMCmd CLASSPATH=/java/jck-dev/users3/dixonj/merlin-cup-build/unzip/JCK-runtime-14/tests/../classes:/java/jck-dev/users3/dixonj/merlin-cup-build/unzip/JCK-runtime-14/javatest.jar DISPLAY=bonesbrigade:0.0 HOME=/home/dixonj LD_LIBRARY_PATH=/java/jck-dev/users3/dixonj/merlin-cup-build/unzip/JCK-runtime-14/tests/../lib /usr/local/java/jdk1.4/solaris/bin/java -Xfuture -Djava.security.policy=/java/jck-dev/users3/dixonj/merlin-cup-build/unzip/JCK-runtime-14/tests/../lib/jck.policy -Djava.rmi.activation.port=57599 javasoft.sqe.tests.api.java.awt.GridBagLayout.serial.InputTests
| ----------ref:(274/18749)----------
| Checking for JDK Version : 1.1
| Creating StreamObject from spec
| Setting the value of serial fields
| Converting the StreamObject to Object
| I/O error. Got exception:
| java.io.InvalidClassException: java.awt.GridBagLayout; Local class not compatible: stream classdesc serialVersionUID=8838754796412211005 local class serialVersionUID=6500203050018709630
| at java.io.ObjectStreamClass.validateLocalClass(ObjectStreamClass.java:523)
| at java.io.ObjectStreamClass.setClass(ObjectStreamClass.java:567)
| at java.io.ObjectInputStream.inputClassDescriptor(ObjectInputStream.java:936)
| at java.io.ObjectInputStream.readObject(ObjectInputStream.java:366)
| at java.io.ObjectInputStream.readObject(ObjectInputStream.java:236)
| at java.io.ObjectInputStream.inputObject(ObjectInputStream.java:1186)
| at java.io.ObjectInputStream.readObject(ObjectInputStream.java:386)
| at java.io.ObjectInputStream.readObject(ObjectInputStream.java:236)
| at javasoft.sqe.serial.util.Convert.streamObjectToObject(Convert.java:60)
| at javasoft.sqe.tests.api.java.awt.GridBagLayout.serial.InputTests.serial2002(InputTests.java:132)
| at java.lang.reflect.Method.invoke(Native Method)
| at javasoft.sqe.javatest.lib.MultiTest.invokeTestCase(MultiTest.java:409)
| at javasoft.sqe.javatest.lib.MultiTest.run(MultiTest.java:205)
| at javasoft.sqe.javatest.lib.MultiTest.run(MultiTest.java:137)
| at javasoft.sqe.tests.api.java.awt.GridBagLayout.serial.InputTests.main(InputTests.java:42)
| Checking for JDK Version : 1.11
| Creating StreamObject from spec
| Setting the value of serial fields
| Converting the StreamObject to Object
| I/O error. Got exception:
| java.io.InvalidClassException: java.awt.GridBagLayout; Local class not compatible: stream classdesc serialVersionUID=8838754796412211005 local class serialVersionUID=6500203050018709630
| at java.io.ObjectStreamClass.validateLocalClass(ObjectStreamClass.java:523)
| at java.io.ObjectStreamClass.setClass(ObjectStreamClass.java:567)
| at java.io.ObjectInputStream.inputClassDescriptor(ObjectInputStream.java:936)
| at java.io.ObjectInputStream.readObject(ObjectInputStream.java:366)
| at java.io.ObjectInputStream.readObject(ObjectInputStream.java:236)
| at java.io.ObjectInputStream.inputObject(ObjectInputStream.java:1186)
| at java.io.ObjectInputStream.readObject(ObjectInputStream.java:386)
| at java.io.ObjectInputStream.readObject(ObjectInputStream.java:236)
| at javasoft.sqe.serial.util.Convert.streamObjectToObject(Convert.java:60)
| at javasoft.sqe.tests.api.java.awt.GridBagLayout.serial.InputTests.serial2002(InputTests.java:132)
| at java.lang.reflect.Method.invoke(Native Method)
| at javasoft.sqe.javatest.lib.MultiTest.invokeTestCase(MultiTest.java:409)
| at javasoft.sqe.javatest.lib.MultiTest.run(MultiTest.java:205)
| at javasoft.sqe.javatest.lib.MultiTest.run(MultiTest.java:137)
| at javasoft.sqe.tests.api.java.awt.GridBagLayout.serial.InputTests.main(InputTests.java:42)
| Checking for JDK Version : 1.12
| Creating StreamObject from spec
| Setting the value of serial fields
| Converting the StreamObject to Object
| I/O error. Got exception:
| java.io.InvalidClassException: java.awt.GridBagLayout; Local class not compatible: stream classdesc serialVersionUID=8838754796412211005 local class serialVersionUID=6500203050018709630
| at java.io.ObjectStreamClass.validateLocalClass(ObjectStreamClass.java:523)
| at java.io.ObjectStreamClass.setClass(ObjectStreamClass.java:567)
| at java.io.ObjectInputStream.inputClassDescriptor(ObjectInputStream.java:936)
| at java.io.ObjectInputStream.readObject(ObjectInputStream.java:366)
| at java.io.ObjectInputStream.readObject(ObjectInputStream.java:236)
| at java.io.ObjectInputStream.inputObject(ObjectInputStream.java:1186)
| at java.io.ObjectInputStream.readObject(ObjectInputStream.java:386)
| at java.io.ObjectInputStream.readObject(ObjectInputStream.java:236)
| at javasoft.sqe.serial.util.Convert.streamObjectToObject(Convert.java:60)
| at javasoft.sqe.tests.api.java.awt.GridBagLayout.serial.InputTests.serial2002(InputTests.java:132)
| at java.lang.reflect.Method.invoke(Native Method)
| at javasoft.sqe.javatest.lib.MultiTest.invokeTestCase(MultiTest.java:409)
| at javasoft.sqe.javatest.lib.MultiTest.run(MultiTest.java:205)
| at javasoft.sqe.javatest.lib.MultiTest.run(MultiTest.java:137)
| at javasoft.sqe.tests.api.java.awt.GridBagLayout.serial.InputTests.main(InputTests.java:42)
skip...
| Checking for JDK Version : 1.22
| Creating StreamObject from spec
| Setting the value of serial fields
| Converting the StreamObject to Object
| I/O error. Got exception:
| java.io.InvalidClassException: java.awt.GridBagLayout; Local class not compatible: stream classdesc serialVersionUID=8838754796412211005 local class serialVersionUID=6500203050018709630
| at java.io.ObjectStreamClass.validateLocalClass(ObjectStreamClass.java:523)
| at java.io.ObjectStreamClass.setClass(ObjectStreamClass.java:567)
| at java.io.ObjectInputStream.inputClassDescriptor(ObjectInputStream.java:936)
| at java.io.ObjectInputStream.readObject(ObjectInputStream.java:366)
| at java.io.ObjectInputStream.readObject(ObjectInputStream.java:236)
| at java.io.ObjectInputStream.inputObject(ObjectInputStream.java:1186)
| at java.io.ObjectInputStream.readObject(ObjectInputStream.java:386)
| at java.io.ObjectInputStream.readObject(ObjectInputStream.java:236)
| at javasoft.sqe.serial.util.Convert.streamObjectToObject(Convert.java:60)
| at javasoft.sqe.tests.api.java.awt.GridBagLayout.serial.InputTests.serial2002(InputTests.java:132)
| at java.lang.reflect.Method.invoke(Native Method)
| at javasoft.sqe.javatest.lib.MultiTest.invokeTestCase(MultiTest.java:409)
| at javasoft.sqe.javatest.lib.MultiTest.run(MultiTest.java:205)
| at javasoft.sqe.javatest.lib.MultiTest.run(MultiTest.java:137)
| at javasoft.sqe.tests.api.java.awt.GridBagLayout.serial.InputTests.main(InputTests.java:42)
| Checking for JDK Version : 1.3
| Creating StreamObject from spec
| Setting the value of serial fields
| Converting the StreamObject to Object
| I/O error. Got exception:
| java.io.InvalidClassException: java.awt.GridBagLayout; Local class not compatible: stream classdesc serialVersionUID=8838754796412211005 local class serialVersionUID=6500203050018709630
| at java.io.ObjectStreamClass.validateLocalClass(ObjectStreamClass.java:523)
| at java.io.ObjectStreamClass.setClass(ObjectStreamClass.java:567)
| at java.io.ObjectInputStream.inputClassDescriptor(ObjectInputStream.java:936)
| at java.io.ObjectInputStream.readObject(ObjectInputStream.java:366)
| at java.io.ObjectInputStream.readObject(ObjectInputStream.java:236)
| at java.io.ObjectInputStream.inputObject(ObjectInputStream.java:1186)
| at java.io.ObjectInputStream.readObject(ObjectInputStream.java:386)
| at java.io.ObjectInputStream.readObject(ObjectInputStream.java:236)
| at javasoft.sqe.serial.util.Convert.streamObjectToObject(Convert.java:60)
| at javasoft.sqe.tests.api.java.awt.GridBagLayout.serial.InputTests.serial2002(InputTests.java:132)
| at java.lang.reflect.Method.invoke(Native Method)
| at javasoft.sqe.javatest.lib.MultiTest.invokeTestCase(MultiTest.java:409)
| at javasoft.sqe.javatest.lib.MultiTest.run(MultiTest.java:205)
| at javasoft.sqe.javatest.lib.MultiTest.run(MultiTest.java:137)
| at javasoft.sqe.tests.api.java.awt.GridBagLayout.serial.InputTests.main(InputTests.java:42)
| serial2002 failed.
| ----------log:(2/98)----------
| serial2002: Failed. FAILED
| STATUS:Failed.tests: 1; failed: 1; first test case failure: serial2002
| result: Failed. tests: 1; failed: 1; first test case failure: serial2002
|
|
| test result: Failed. tests: 1; failed: 1; first test case failure: serial2002</XMP></BODY></HTML>
|
----------------------------------------
======================================================================
Name: dfR10049 Date: 06/27/2000
The next classes have signature changes:
java.awt.font.TransformAttribute
java.awt.GridBagLayout
But serialVersionUID is not chaged. So the next jck-tweety tests failes:
api/java_awt/Font/TransformAttribute/serial/index.html#Constructor
api/java_awt/Font/TransformAttribute/serial/index.html#Input
api/java_awt/GridBagLayout/serial/index.html#Input
To more info about failures see jtr files below.
============================= jtr files =============================
api/java_awt/Font/TransformAttribute/serial/index.html#Constructor
| <!DOCTYPE HTML PUBLIC "-//W3C//DTD HTML 4.0 Transitional//EN">
| <HTML><HEAD>
| <META content="text/html; charset=windows-1252" http-equiv=Content-Type>
| <META content="MSHTML 5.00.2013.1310" name=GENERATOR></HEAD>
| <BODY><XMP>#Test Results (version 2)
| #Sat Jun 24 06:29:11 PDT 2000
| #checksum:6adf54637c5fd80f
| #-----testdescription-----
| $file=/java/jck-dev/users3/dixonj/merlin-cup-build/unzip/JCK-runtime-14/tests/api/java_awt/Font/TransformAttribute/serial/index.html
| $root=/java/jck-dev/users3/dixonj/merlin-cup-build/unzip/JCK-runtime-14/tests
| executeClass=javasoft.sqe.tests.api.java.awt.Font.TransformAttribute.serial.ConstructorTests
| id=Constructor
| keywords=positive runtime
| source=ConstructorTests.java
| title=TransformAttribute ConstructorTest tests
|
| #-----environment-----
| DISPLAY=bonesbrigade:0.0
| ExecJCKTestOtherJVMCmd=javasoft.sqe.javatest.lib.ExecJCKTestOtherJVMCmd
| command.testExecute=$ExecJCKTestOtherJVMCmd CLASSPATH=$testSuiteRootDir/../classes$:$javatestClassDir DISPLAY=$DISPLAY HOME=${user.home} LD_LIBRARY_PATH=$testSuiteRootDir/../lib /usr/local/java/jdk1.4/solaris/bin/java -Xfuture -Djava.security.policy=$testSuiteRootDir/../lib/jck.policy -Djava.rmi.activation.port=${java.rmi.activation.port} $testExecuteClass $testExecuteArgs
| java.rmi.activation.port=57599
| user.home=/home/dixonj
|
| #-----testresult-----
| description=file:///java/jck-dev/users3/dixonj/merlin-cup-build/unzip/JCK-runtime-14/tests/api/java_awt/Font/TransformAttribute/serial/index.html#Constructor
| end=Sat Jun 24 06:29:11 PDT 2000
| environment=jck-runtime-solaris
| execStatus=Failed. tests: 1; failed: 1; first test case failure: serial2001
| javatestOS=SunOS 5.7 (sparc)
| javatestVersion=JT_2.1.3h
| script=javasoft.sqe.javatest.lib.JCKScript -runtime
| sections=script_messages testExecute
| start=Sat Jun 24 06:29:09 PDT 2000
| status=Failed. tests: 1; failed: 1; first test case failure: serial2001
| test=api/java_awt/Font/TransformAttribute/serial/index.html#Constructor
| timeoutSeconds=600
| work=/java/jck-dev/users3/dixonj/merlin-cup-build/test/JCK-runtime-14/runtime-batch-multiJVM-jit-native/work/api/java_awt/Font/TransformAttribute/serial
|
| #section:script_messages
| ----------messages:(1/24)----------
| Executing test class...
|
| #section:testExecute
| ----------messages:(1/643)----------
| command: javasoft.sqe.javatest.lib.ExecJCKTestOtherJVMCmd CLASSPATH=/java/jck-dev/users3/dixonj/merlin-cup-build/unzip/JCK-runtime-14/tests/../classes:/java/jck-dev/users3/dixonj/merlin-cup-build/unzip/JCK-runtime-14/javatest.jar DISPLAY=bonesbrigade:0.0 HOME=/home/dixonj LD_LIBRARY_PATH=/java/jck-dev/users3/dixonj/merlin-cup-build/unzip/JCK-runtime-14/tests/../lib /usr/local/java/jdk1.4/solaris/bin/java -Xfuture -Djava.security.policy=/java/jck-dev/users3/dixonj/merlin-cup-build/unzip/JCK-runtime-14/tests/../lib/jck.policy -Djava.rmi.activation.port=57599 javasoft.sqe.tests.api.java.awt.Font.TransformAttribute.serial.ConstructorTests
| ----------ref:(18/619)----------
| Creating StreamObject from Object
| Checking for JDK Version : 1.2
| Creating spec class.
| Verifying the constraints on the serial fields
| Field transform not correctly serialized.
| Checking for JDK Version : 1.21
| Creating spec class.
| Verifying the constraints on the serial fields
| Field transform not correctly serialized.
| Checking for JDK Version : 1.22
| Creating spec class.
| Verifying the constraints on the serial fields
| Field transform not correctly serialized.
| Checking for JDK Version : 1.3
| Creating spec class.
| Verifying the constraints on the serial fields
| Field transform not correctly serialized.
| serial2001 failed.
| ----------log:(2/98)----------
| serial2001: Failed. FAILED
| STATUS:Failed.tests: 1; failed: 1; first test case failure: serial2001
| result: Failed. tests: 1; failed: 1; first test case failure: serial2001
|
|
| test result: Failed. tests: 1; failed: 1; first test case failure: serial2001</XMP></BODY></HTML>
|
|
api/java_awt/Font/TransformAttribute/serial/index.html#Input:
| <!DOCTYPE HTML PUBLIC "-//W3C//DTD HTML 4.0 Transitional//EN">
| <HTML><HEAD>
| <META content="text/html; charset=windows-1252" http-equiv=Content-Type>
| <META content="MSHTML 5.00.2013.1310" name=GENERATOR></HEAD>
| <BODY><XMP>#Test Results (version 2)
| #Sat Jun 24 06:29:14 PDT 2000
| #checksum:241d14a9bdc832e9
| #-----testdescription-----
| $file=/java/jck-dev/users3/dixonj/merlin-cup-build/unzip/JCK-runtime-14/tests/api/java_awt/Font/TransformAttribute/serial/index.html
| $root=/java/jck-dev/users3/dixonj/merlin-cup-build/unzip/JCK-runtime-14/tests
| executeClass=javasoft.sqe.tests.api.java.awt.Font.TransformAttribute.serial.InputTests
| id=Input
| keywords=positive runtime
| source=InputTests.java
| title=TransformAttribute InputTests tests
|
| #-----environment-----
| DISPLAY=bonesbrigade:0.0
| ExecJCKTestOtherJVMCmd=javasoft.sqe.javatest.lib.ExecJCKTestOtherJVMCmd
| command.testExecute=$ExecJCKTestOtherJVMCmd CLASSPATH=$testSuiteRootDir/../classes$:$javatestClassDir DISPLAY=$DISPLAY HOME=${user.home} LD_LIBRARY_PATH=$testSuiteRootDir/../lib /usr/local/java/jdk1.4/solaris/bin/java -Xfuture -Djava.security.policy=$testSuiteRootDir/../lib/jck.policy -Djava.rmi.activation.port=${java.rmi.activation.port} $testExecuteClass $testExecuteArgs
| java.rmi.activation.port=57599
| user.home=/home/dixonj
|
| #-----testresult-----
| description=file:///java/jck-dev/users3/dixonj/merlin-cup-build/unzip/JCK-runtime-14/tests/api/java_awt/Font/TransformAttribute/serial/index.html#Input
| end=Sat Jun 24 06:29:14 PDT 2000
| environment=jck-runtime-solaris
| execStatus=Failed. tests: 1; failed: 1; first test case failure: serial2002
| javatestOS=SunOS 5.7 (sparc)
| javatestVersion=JT_2.1.3h
| script=javasoft.sqe.javatest.lib.JCKScript -runtime
| sections=script_messages testExecute
| start=Sat Jun 24 06:29:12 PDT 2000
| status=Failed. tests: 1; failed: 1; first test case failure: serial2002
| test=api/java_awt/Font/TransformAttribute/serial/index.html#Input
| timeoutSeconds=600
| work=/java/jck-dev/users3/dixonj/merlin-cup-build/test/JCK-runtime-14/runtime-batch-multiJVM-jit-native/work/api/java_awt/Font/TransformAttribute/serial
|
| #section:script_messages
| ----------messages:(1/24)----------
| Executing test class...
|
| #section:testExecute
| ----------messages:(1/637)----------
| command: javasoft.sqe.javatest.lib.ExecJCKTestOtherJVMCmd CLASSPATH=/java/jck-dev/users3/dixonj/merlin-cup-build/unzip/JCK-runtime-14/tests/../classes:/java/jck-dev/users3/dixonj/merlin-cup-build/unzip/JCK-runtime-14/javatest.jar DISPLAY=bonesbrigade:0.0 HOME=/home/dixonj LD_LIBRARY_PATH=/java/jck-dev/users3/dixonj/merlin-cup-build/unzip/JCK-runtime-14/tests/../lib /usr/local/java/jdk1.4/solaris/bin/java -Xfuture -Djava.security.policy=/java/jck-dev/users3/dixonj/merlin-cup-build/unzip/JCK-runtime-14/tests/../lib/jck.policy -Djava.rmi.activation.port=57599 javasoft.sqe.tests.api.java.awt.Font.TransformAttribute.serial.InputTests
| ----------ref:(85/5905)----------
| Checking for JDK Version : 1.2
| Creating StreamObject from spec
| Setting the value of serial fields
| Converting the StreamObject to Object
| I/O error. Got exception:
| java.io.InvalidClassException: java.awt.font.TransformAttribute; Local class not compatible: stream classdesc serialVersionUID=3356247357827709530 local class serialVersionUID=-6989390531895433322
| at java.io.ObjectStreamClass.validateLocalClass(ObjectStreamClass.java:523)
| at java.io.ObjectStreamClass.setClass(ObjectStreamClass.java:567)
| at java.io.ObjectInputStream.inputClassDescriptor(ObjectInputStream.java:936)
| at java.io.ObjectInputStream.readObject(ObjectInputStream.java:366)
| at java.io.ObjectInputStream.readObject(ObjectInputStream.java:236)
| at java.io.ObjectInputStream.inputObject(ObjectInputStream.java:1186)
| at java.io.ObjectInputStream.readObject(ObjectInputStream.java:386)
| at java.io.ObjectInputStream.readObject(ObjectInputStream.java:236)
| at javasoft.sqe.serial.util.Convert.streamObjectToObject(Convert.java:60)
| at javasoft.sqe.tests.api.java.awt.Font.TransformAttribute.serial.InputTests.serial2002(InputTests.java:104)
| at java.lang.reflect.Method.invoke(Native Method)
| at javasoft.sqe.javatest.lib.MultiTest.invokeTestCase(MultiTest.java:409)
| at javasoft.sqe.javatest.lib.MultiTest.run(MultiTest.java:205)
| at javasoft.sqe.javatest.lib.MultiTest.run(MultiTest.java:137)
| at javasoft.sqe.tests.api.java.awt.Font.TransformAttribute.serial.InputTests.main(InputTests.java:42)
| Checking for JDK Version : 1.21
| Creating StreamObject from spec
| Setting the value of serial fields
| Converting the StreamObject to Object
| I/O error. Got exception:
| java.io.InvalidClassException: java.awt.font.TransformAttribute; Local class not compatible: stream classdesc serialVersionUID=3356247357827709530 local class serialVersionUID=-6989390531895433322
| at java.io.ObjectStreamClass.validateLocalClass(ObjectStreamClass.java:523)
| at java.io.ObjectStreamClass.setClass(ObjectStreamClass.java:567)
| at java.io.ObjectInputStream.inputClassDescriptor(ObjectInputStream.java:936)
| at java.io.ObjectInputStream.readObject(ObjectInputStream.java:366)
| at java.io.ObjectInputStream.readObject(ObjectInputStream.java:236)
| at java.io.ObjectInputStream.inputObject(ObjectInputStream.java:1186)
| at java.io.ObjectInputStream.readObject(ObjectInputStream.java:386)
| at java.io.ObjectInputStream.readObject(ObjectInputStream.java:236)
| at javasoft.sqe.serial.util.Convert.streamObjectToObject(Convert.java:60)
| at javasoft.sqe.tests.api.java.awt.Font.TransformAttribute.serial.InputTests.serial2002(InputTests.java:104)
| at java.lang.reflect.Method.invoke(Native Method)
| at javasoft.sqe.javatest.lib.MultiTest.invokeTestCase(MultiTest.java:409)
| at javasoft.sqe.javatest.lib.MultiTest.run(MultiTest.java:205)
| at javasoft.sqe.javatest.lib.MultiTest.run(MultiTest.java:137)
| at javasoft.sqe.tests.api.java.awt.Font.TransformAttribute.serial.InputTests.main(InputTests.java:42)
| Checking for JDK Version : 1.22
| Creating StreamObject from spec
| Setting the value of serial fields
| Converting the StreamObject to Object
| I/O error. Got exception:
| java.io.InvalidClassException: java.awt.font.TransformAttribute; Local class not compatible: stream classdesc serialVersionUID=3356247357827709530 local class serialVersionUID=-6989390531895433322
| at java.io.ObjectStreamClass.validateLocalClass(ObjectStreamClass.java:523)
| at java.io.ObjectStreamClass.setClass(ObjectStreamClass.java:567)
| at java.io.ObjectInputStream.inputClassDescriptor(ObjectInputStream.java:936)
| at java.io.ObjectInputStream.readObject(ObjectInputStream.java:366)
| at java.io.ObjectInputStream.readObject(ObjectInputStream.java:236)
| at java.io.ObjectInputStream.inputObject(ObjectInputStream.java:1186)
| at java.io.ObjectInputStream.readObject(ObjectInputStream.java:386)
| at java.io.ObjectInputStream.readObject(ObjectInputStream.java:236)
| at javasoft.sqe.serial.util.Convert.streamObjectToObject(Convert.java:60)
| at javasoft.sqe.tests.api.java.awt.Font.TransformAttribute.serial.InputTests.serial2002(InputTests.java:104)
| at java.lang.reflect.Method.invoke(Native Method)
| at javasoft.sqe.javatest.lib.MultiTest.invokeTestCase(MultiTest.java:409)
| at javasoft.sqe.javatest.lib.MultiTest.run(MultiTest.java:205)
| at javasoft.sqe.javatest.lib.MultiTest.run(MultiTest.java:137)
| at javasoft.sqe.tests.api.java.awt.Font.TransformAttribute.serial.InputTests.main(InputTests.java:42)
| Checking for JDK Version : 1.3
| Creating StreamObject from spec
| Setting the value of serial fields
| Converting the StreamObject to Object
| I/O error. Got exception:
| java.io.InvalidClassException: java.awt.font.TransformAttribute; Local class not compatible: stream classdesc serialVersionUID=3356247357827709530 local class serialVersionUID=-6989390531895433322
| at java.io.ObjectStreamClass.validateLocalClass(ObjectStreamClass.java:523)
| at java.io.ObjectStreamClass.setClass(ObjectStreamClass.java:567)
| at java.io.ObjectInputStream.inputClassDescriptor(ObjectInputStream.java:936)
| at java.io.ObjectInputStream.readObject(ObjectInputStream.java:366)
| at java.io.ObjectInputStream.readObject(ObjectInputStream.java:236)
| at java.io.ObjectInputStream.inputObject(ObjectInputStream.java:1186)
| at java.io.ObjectInputStream.readObject(ObjectInputStream.java:386)
| at java.io.ObjectInputStream.readObject(ObjectInputStream.java:236)
| at javasoft.sqe.serial.util.Convert.streamObjectToObject(Convert.java:60)
| at javasoft.sqe.tests.api.java.awt.Font.TransformAttribute.serial.InputTests.serial2002(InputTests.java:104)
| at java.lang.reflect.Method.invoke(Native Method)
| at javasoft.sqe.javatest.lib.MultiTest.invokeTestCase(MultiTest.java:409)
| at javasoft.sqe.javatest.lib.MultiTest.run(MultiTest.java:205)
| at javasoft.sqe.javatest.lib.MultiTest.run(MultiTest.java:137)
| at javasoft.sqe.tests.api.java.awt.Font.TransformAttribute.serial.InputTests.main(InputTests.java:42)
| serial2002 failed.
| ----------log:(2/98)----------
| serial2002: Failed. FAILED
| STATUS:Failed.tests: 1; failed: 1; first test case failure: serial2002
| result: Failed. tests: 1; failed: 1; first test case failure: serial2002
|
|
| test result: Failed. tests: 1; failed: 1; first test case failure: serial2002</XMP></BODY></HTML>
|
| api/java_awt/GridBagLayout/serial/index.html#Input:
|
| <!DOCTYPE HTML PUBLIC "-//W3C//DTD HTML 4.0 Transitional//EN">
| <HTML><HEAD>
| <META content="text/html; charset=windows-1252" http-equiv=Content-Type>
| <META content="MSHTML 5.00.2013.1310" name=GENERATOR></HEAD>
| <BODY><XMP>#Test Results (version 2)
| #Sat Jun 24 06:31:13 PDT 2000
| #checksum:13252be74bab4ba9
| #-----testdescription-----
| $file=/java/jck-dev/users3/dixonj/merlin-cup-build/unzip/JCK-runtime-14/tests/api/java_awt/GridBagLayout/serial/index.html
| $root=/java/jck-dev/users3/dixonj/merlin-cup-build/unzip/JCK-runtime-14/tests
| executeClass=javasoft.sqe.tests.api.java.awt.GridBagLayout.serial.InputTests
| id=Input
| keywords=positive runtime
| source=InputTests.java
| title=GridBagLayout InputTests tests
|
| #-----environment-----
| DISPLAY=bonesbrigade:0.0
| ExecJCKTestOtherJVMCmd=javasoft.sqe.javatest.lib.ExecJCKTestOtherJVMCmd
| command.testExecute=$ExecJCKTestO
| java.rmi.activation.port=57599
| user.home=/home/dixonj
|
| #-----testresult-----
| description=file:///java/jck-dev/users3/dixonj/merlin-cup-build/unzip/JCK-runtime-14/tests/api/java_awt/GridBagLayout/serial/index.html#Input
| end=Sat Jun 24 06:31:13 PDT 2000
| environment=jck-runtime-solaris
| execStatus=Failed. tests: 1; failed: 1; first test case failure: serial2002
| javatestOS=SunOS 5.7 (sparc)
| javatestVersion=JT_2.1.3h
| script=javasoft.sqe.javatest.lib.JCKScript -runtime
| sections=script_messages testExecute
| start=Sat Jun 24 06:31:10 PDT 2000
| status=Failed. tests: 1; failed: 1; first test case failure: serial2002
| test=api/java_awt/GridBagLayout/serial/index.html#Input
| timeoutSeconds=600
| work=/java/jck-dev/users3/dixonj/merlin-cup-build/test/JCK-runtime-14/runtime-batch-multiJVM-jit-native/work/api/java_awt/GridBagLayout/serial
|
| #section:script_messages
| ----------messages:(1/24)----------
| Executing test class...
|
| #section:testExecute
| ----------messages:(1/627)----------
| command: javasoft.sqe.javatest.lib.ExecJCKTestOtherJVMCmd CLASSPATH=/java/jck-dev/users3/dixonj/merlin-cup-build/unzip/JCK-runtime-14/tests/../classes:/java/jck-dev/users3/dixonj/merlin-cup-build/unzip/JCK-runtime-14/javatest.jar DISPLAY=bonesbrigade:0.0 HOME=/home/dixonj LD_LIBRARY_PATH=/java/jck-dev/users3/dixonj/merlin-cup-build/unzip/JCK-runtime-14/tests/../lib /usr/local/java/jdk1.4/solaris/bin/java -Xfuture -Djava.security.policy=/java/jck-dev/users3/dixonj/merlin-cup-build/unzip/JCK-runtime-14/tests/../lib/jck.policy -Djava.rmi.activation.port=57599 javasoft.sqe.tests.api.java.awt.GridBagLayout.serial.InputTests
| ----------ref:(274/18749)----------
| Checking for JDK Version : 1.1
| Creating StreamObject from spec
| Setting the value of serial fields
| Converting the StreamObject to Object
| I/O error. Got exception:
| java.io.InvalidClassException: java.awt.GridBagLayout; Local class not compatible: stream classdesc serialVersionUID=8838754796412211005 local class serialVersionUID=6500203050018709630
| at java.io.ObjectStreamClass.validateLocalClass(ObjectStreamClass.java:523)
| at java.io.ObjectStreamClass.setClass(ObjectStreamClass.java:567)
| at java.io.ObjectInputStream.inputClassDescriptor(ObjectInputStream.java:936)
| at java.io.ObjectInputStream.readObject(ObjectInputStream.java:366)
| at java.io.ObjectInputStream.readObject(ObjectInputStream.java:236)
| at java.io.ObjectInputStream.inputObject(ObjectInputStream.java:1186)
| at java.io.ObjectInputStream.readObject(ObjectInputStream.java:386)
| at java.io.ObjectInputStream.readObject(ObjectInputStream.java:236)
| at javasoft.sqe.serial.util.Convert.streamObjectToObject(Convert.java:60)
| at javasoft.sqe.tests.api.java.awt.GridBagLayout.serial.InputTests.serial2002(InputTests.java:132)
| at java.lang.reflect.Method.invoke(Native Method)
| at javasoft.sqe.javatest.lib.MultiTest.invokeTestCase(MultiTest.java:409)
| at javasoft.sqe.javatest.lib.MultiTest.run(MultiTest.java:205)
| at javasoft.sqe.javatest.lib.MultiTest.run(MultiTest.java:137)
| at javasoft.sqe.tests.api.java.awt.GridBagLayout.serial.InputTests.main(InputTests.java:42)
| Checking for JDK Version : 1.11
| Creating StreamObject from spec
| Setting the value of serial fields
| Converting the StreamObject to Object
| I/O error. Got exception:
| java.io.InvalidClassException: java.awt.GridBagLayout; Local class not compatible: stream classdesc serialVersionUID=8838754796412211005 local class serialVersionUID=6500203050018709630
| at java.io.ObjectStreamClass.validateLocalClass(ObjectStreamClass.java:523)
| at java.io.ObjectStreamClass.setClass(ObjectStreamClass.java:567)
| at java.io.ObjectInputStream.inputClassDescriptor(ObjectInputStream.java:936)
| at java.io.ObjectInputStream.readObject(ObjectInputStream.java:366)
| at java.io.ObjectInputStream.readObject(ObjectInputStream.java:236)
| at java.io.ObjectInputStream.inputObject(ObjectInputStream.java:1186)
| at java.io.ObjectInputStream.readObject(ObjectInputStream.java:386)
| at java.io.ObjectInputStream.readObject(ObjectInputStream.java:236)
| at javasoft.sqe.serial.util.Convert.streamObjectToObject(Convert.java:60)
| at javasoft.sqe.tests.api.java.awt.GridBagLayout.serial.InputTests.serial2002(InputTests.java:132)
| at java.lang.reflect.Method.invoke(Native Method)
| at javasoft.sqe.javatest.lib.MultiTest.invokeTestCase(MultiTest.java:409)
| at javasoft.sqe.javatest.lib.MultiTest.run(MultiTest.java:205)
| at javasoft.sqe.javatest.lib.MultiTest.run(MultiTest.java:137)
| at javasoft.sqe.tests.api.java.awt.GridBagLayout.serial.InputTests.main(InputTests.java:42)
| Checking for JDK Version : 1.12
| Creating StreamObject from spec
| Setting the value of serial fields
| Converting the StreamObject to Object
| I/O error. Got exception:
| java.io.InvalidClassException: java.awt.GridBagLayout; Local class not compatible: stream classdesc serialVersionUID=8838754796412211005 local class serialVersionUID=6500203050018709630
| at java.io.ObjectStreamClass.validateLocalClass(ObjectStreamClass.java:523)
| at java.io.ObjectStreamClass.setClass(ObjectStreamClass.java:567)
| at java.io.ObjectInputStream.inputClassDescriptor(ObjectInputStream.java:936)
| at java.io.ObjectInputStream.readObject(ObjectInputStream.java:366)
| at java.io.ObjectInputStream.readObject(ObjectInputStream.java:236)
| at java.io.ObjectInputStream.inputObject(ObjectInputStream.java:1186)
| at java.io.ObjectInputStream.readObject(ObjectInputStream.java:386)
| at java.io.ObjectInputStream.readObject(ObjectInputStream.java:236)
| at javasoft.sqe.serial.util.Convert.streamObjectToObject(Convert.java:60)
| at javasoft.sqe.tests.api.java.awt.GridBagLayout.serial.InputTests.serial2002(InputTests.java:132)
| at java.lang.reflect.Method.invoke(Native Method)
| at javasoft.sqe.javatest.lib.MultiTest.invokeTestCase(MultiTest.java:409)
| at javasoft.sqe.javatest.lib.MultiTest.run(MultiTest.java:205)
| at javasoft.sqe.javatest.lib.MultiTest.run(MultiTest.java:137)
| at javasoft.sqe.tests.api.java.awt.GridBagLayout.serial.InputTests.main(InputTests.java:42)
skip...
| Checking for JDK Version : 1.22
| Creating StreamObject from spec
| Setting the value of serial fields
| Converting the StreamObject to Object
| I/O error. Got exception:
| java.io.InvalidClassException: java.awt.GridBagLayout; Local class not compatible: stream classdesc serialVersionUID=8838754796412211005 local class serialVersionUID=6500203050018709630
| at java.io.ObjectStreamClass.validateLocalClass(ObjectStreamClass.java:523)
| at java.io.ObjectStreamClass.setClass(ObjectStreamClass.java:567)
| at java.io.ObjectInputStream.inputClassDescriptor(ObjectInputStream.java:936)
| at java.io.ObjectInputStream.readObject(ObjectInputStream.java:366)
| at java.io.ObjectInputStream.readObject(ObjectInputStream.java:236)
| at java.io.ObjectInputStream.inputObject(ObjectInputStream.java:1186)
| at java.io.ObjectInputStream.readObject(ObjectInputStream.java:386)
| at java.io.ObjectInputStream.readObject(ObjectInputStream.java:236)
| at javasoft.sqe.serial.util.Convert.streamObjectToObject(Convert.java:60)
| at javasoft.sqe.tests.api.java.awt.GridBagLayout.serial.InputTests.serial2002(InputTests.java:132)
| at java.lang.reflect.Method.invoke(Native Method)
| at javasoft.sqe.javatest.lib.MultiTest.invokeTestCase(MultiTest.java:409)
| at javasoft.sqe.javatest.lib.MultiTest.run(MultiTest.java:205)
| at javasoft.sqe.javatest.lib.MultiTest.run(MultiTest.java:137)
| at javasoft.sqe.tests.api.java.awt.GridBagLayout.serial.InputTests.main(InputTests.java:42)
| Checking for JDK Version : 1.3
| Creating StreamObject from spec
| Setting the value of serial fields
| Converting the StreamObject to Object
| I/O error. Got exception:
| java.io.InvalidClassException: java.awt.GridBagLayout; Local class not compatible: stream classdesc serialVersionUID=8838754796412211005 local class serialVersionUID=6500203050018709630
| at java.io.ObjectStreamClass.validateLocalClass(ObjectStreamClass.java:523)
| at java.io.ObjectStreamClass.setClass(ObjectStreamClass.java:567)
| at java.io.ObjectInputStream.inputClassDescriptor(ObjectInputStream.java:936)
| at java.io.ObjectInputStream.readObject(ObjectInputStream.java:366)
| at java.io.ObjectInputStream.readObject(ObjectInputStream.java:236)
| at java.io.ObjectInputStream.inputObject(ObjectInputStream.java:1186)
| at java.io.ObjectInputStream.readObject(ObjectInputStream.java:386)
| at java.io.ObjectInputStream.readObject(ObjectInputStream.java:236)
| at javasoft.sqe.serial.util.Convert.streamObjectToObject(Convert.java:60)
| at javasoft.sqe.tests.api.java.awt.GridBagLayout.serial.InputTests.serial2002(InputTests.java:132)
| at java.lang.reflect.Method.invoke(Native Method)
| at javasoft.sqe.javatest.lib.MultiTest.invokeTestCase(MultiTest.java:409)
| at javasoft.sqe.javatest.lib.MultiTest.run(MultiTest.java:205)
| at javasoft.sqe.javatest.lib.MultiTest.run(MultiTest.java:137)
| at javasoft.sqe.tests.api.java.awt.GridBagLayout.serial.InputTests.main(InputTests.java:42)
| serial2002 failed.
| ----------log:(2/98)----------
| serial2002: Failed. FAILED
| STATUS:Failed.tests: 1; failed: 1; first test case failure: serial2002
| result: Failed. tests: 1; failed: 1; first test case failure: serial2002
|
|
| test result: Failed. tests: 1; failed: 1; first test case failure: serial2002</XMP></BODY></HTML>
|
----------------------------------------
======================================================================
Name: dfR10049 Date: 06/27/2000
The next classes have signature changes:
java.awt.font.TransformAttribute
java.awt.GridBagLayout
But serialVersionUID is not chaged. So the next jck-tweety tests failes:
api/java_awt/Font/TransformAttribute/serial/index.html#Constructor
api/java_awt/Font/TransformAttribute/serial/index.html#Input
api/java_awt/GridBagLayout/serial/index.html#Input
To more info about failures see jtr files below.
============================= jtr files =============================
api/java_awt/Font/TransformAttribute/serial/index.html#Constructor
| <!DOCTYPE HTML PUBLIC "-//W3C//DTD HTML 4.0 Transitional//EN">
| <HTML><HEAD>
| <META content="text/html; charset=windows-1252" http-equiv=Content-Type>
| <META content="MSHTML 5.00.2013.1310" name=GENERATOR></HEAD>
| <BODY><XMP>#Test Results (version 2)
| #Sat Jun 24 06:29:11 PDT 2000
| #checksum:6adf54637c5fd80f
| #-----testdescription-----
| $file=/java/jck-dev/users3/dixonj/merlin-cup-build/unzip/JCK-runtime-14/tests/api/java_awt/Font/TransformAttribute/serial/index.html
| $root=/java/jck-dev/users3/dixonj/merlin-cup-build/unzip/JCK-runtime-14/tests
| executeClass=javasoft.sqe.tests.api.java.awt.Font.TransformAttribute.serial.ConstructorTests
| id=Constructor
| keywords=positive runtime
| source=ConstructorTests.java
| title=TransformAttribute ConstructorTest tests
|
| #-----environment-----
| DISPLAY=bonesbrigade:0.0
| ExecJCKTestOtherJVMCmd=javasoft.sqe.javatest.lib.ExecJCKTestOtherJVMCmd
| command.testExecute=$ExecJCKTestOtherJVMCmd CLASSPATH=$testSuiteRootDir/../classes$:$javatestClassDir DISPLAY=$DISPLAY HOME=${user.home} LD_LIBRARY_PATH=$testSuiteRootDir/../lib /usr/local/java/jdk1.4/solaris/bin/java -Xfuture -Djava.security.policy=$testSuiteRootDir/../lib/jck.policy -Djava.rmi.activation.port=${java.rmi.activation.port} $testExecuteClass $testExecuteArgs
| java.rmi.activation.port=57599
| user.home=/home/dixonj
|
| #-----testresult-----
| description=file:///java/jck-dev/users3/dixonj/merlin-cup-build/unzip/JCK-runtime-14/tests/api/java_awt/Font/TransformAttribute/serial/index.html#Constructor
| end=Sat Jun 24 06:29:11 PDT 2000
| environment=jck-runtime-solaris
| execStatus=Failed. tests: 1; failed: 1; first test case failure: serial2001
| javatestOS=SunOS 5.7 (sparc)
| javatestVersion=JT_2.1.3h
| script=javasoft.sqe.javatest.lib.JCKScript -runtime
| sections=script_messages testExecute
| start=Sat Jun 24 06:29:09 PDT 2000
| status=Failed. tests: 1; failed: 1; first test case failure: serial2001
| test=api/java_awt/Font/TransformAttribute/serial/index.html#Constructor
| timeoutSeconds=600
| work=/java/jck-dev/users3/dixonj/merlin-cup-build/test/JCK-runtime-14/runtime-batch-multiJVM-jit-native/work/api/java_awt/Font/TransformAttribute/serial
|
| #section:script_messages
| ----------messages:(1/24)----------
| Executing test class...
|
| #section:testExecute
| ----------messages:(1/643)----------
| command: javasoft.sqe.javatest.lib.ExecJCKTestOtherJVMCmd CLASSPATH=/java/jck-dev/users3/dixonj/merlin-cup-build/unzip/JCK-runtime-14/tests/../classes:/java/jck-dev/users3/dixonj/merlin-cup-build/unzip/JCK-runtime-14/javatest.jar DISPLAY=bonesbrigade:0.0 HOME=/home/dixonj LD_LIBRARY_PATH=/java/jck-dev/users3/dixonj/merlin-cup-build/unzip/JCK-runtime-14/tests/../lib /usr/local/java/jdk1.4/solaris/bin/java -Xfuture -Djava.security.policy=/java/jck-dev/users3/dixonj/merlin-cup-build/unzip/JCK-runtime-14/tests/../lib/jck.policy -Djava.rmi.activation.port=57599 javasoft.sqe.tests.api.java.awt.Font.TransformAttribute.serial.ConstructorTests
| ----------ref:(18/619)----------
| Creating StreamObject from Object
| Checking for JDK Version : 1.2
| Creating spec class.
| Verifying the constraints on the serial fields
| Field transform not correctly serialized.
| Checking for JDK Version : 1.21
| Creating spec class.
| Verifying the constraints on the serial fields
| Field transform not correctly serialized.
| Checking for JDK Version : 1.22
| Creating spec class.
| Verifying the constraints on the serial fields
| Field transform not correctly serialized.
| Checking for JDK Version : 1.3
| Creating spec class.
| Verifying the constraints on the serial fields
| Field transform not correctly serialized.
| serial2001 failed.
| ----------log:(2/98)----------
| serial2001: Failed. FAILED
| STATUS:Failed.tests: 1; failed: 1; first test case failure: serial2001
| result: Failed. tests: 1; failed: 1; first test case failure: serial2001
|
|
| test result: Failed. tests: 1; failed: 1; first test case failure: serial2001</XMP></BODY></HTML>
|
|
api/java_awt/Font/TransformAttribute/serial/index.html#Input:
| <!DOCTYPE HTML PUBLIC "-//W3C//DTD HTML 4.0 Transitional//EN">
| <HTML><HEAD>
| <META content="text/html; charset=windows-1252" http-equiv=Content-Type>
| <META content="MSHTML 5.00.2013.1310" name=GENERATOR></HEAD>
| <BODY><XMP>#Test Results (version 2)
| #Sat Jun 24 06:29:14 PDT 2000
| #checksum:241d14a9bdc832e9
| #-----testdescription-----
| $file=/java/jck-dev/users3/dixonj/merlin-cup-build/unzip/JCK-runtime-14/tests/api/java_awt/Font/TransformAttribute/serial/index.html
| $root=/java/jck-dev/users3/dixonj/merlin-cup-build/unzip/JCK-runtime-14/tests
| executeClass=javasoft.sqe.tests.api.java.awt.Font.TransformAttribute.serial.InputTests
| id=Input
| keywords=positive runtime
| source=InputTests.java
| title=TransformAttribute InputTests tests
|
| #-----environment-----
| DISPLAY=bonesbrigade:0.0
| ExecJCKTestOtherJVMCmd=javasoft.sqe.javatest.lib.ExecJCKTestOtherJVMCmd
| command.testExecute=$ExecJCKTestOtherJVMCmd CLASSPATH=$testSuiteRootDir/../classes$:$javatestClassDir DISPLAY=$DISPLAY HOME=${user.home} LD_LIBRARY_PATH=$testSuiteRootDir/../lib /usr/local/java/jdk1.4/solaris/bin/java -Xfuture -Djava.security.policy=$testSuiteRootDir/../lib/jck.policy -Djava.rmi.activation.port=${java.rmi.activation.port} $testExecuteClass $testExecuteArgs
| java.rmi.activation.port=57599
| user.home=/home/dixonj
|
| #-----testresult-----
| description=file:///java/jck-dev/users3/dixonj/merlin-cup-build/unzip/JCK-runtime-14/tests/api/java_awt/Font/TransformAttribute/serial/index.html#Input
| end=Sat Jun 24 06:29:14 PDT 2000
| environment=jck-runtime-solaris
| execStatus=Failed. tests: 1; failed: 1; first test case failure: serial2002
| javatestOS=SunOS 5.7 (sparc)
| javatestVersion=JT_2.1.3h
| script=javasoft.sqe.javatest.lib.JCKScript -runtime
| sections=script_messages testExecute
| start=Sat Jun 24 06:29:12 PDT 2000
| status=Failed. tests: 1; failed: 1; first test case failure: serial2002
| test=api/java_awt/Font/TransformAttribute/serial/index.html#Input
| timeoutSeconds=600
| work=/java/jck-dev/users3/dixonj/merlin-cup-build/test/JCK-runtime-14/runtime-batch-multiJVM-jit-native/work/api/java_awt/Font/TransformAttribute/serial
|
| #section:script_messages
| ----------messages:(1/24)----------
| Executing test class...
|
| #section:testExecute
| ----------messages:(1/637)----------
| command: javasoft.sqe.javatest.lib.ExecJCKTestOtherJVMCmd CLASSPATH=/java/jck-dev/users3/dixonj/merlin-cup-build/unzip/JCK-runtime-14/tests/../classes:/java/jck-dev/users3/dixonj/merlin-cup-build/unzip/JCK-runtime-14/javatest.jar DISPLAY=bonesbrigade:0.0 HOME=/home/dixonj LD_LIBRARY_PATH=/java/jck-dev/users3/dixonj/merlin-cup-build/unzip/JCK-runtime-14/tests/../lib /usr/local/java/jdk1.4/solaris/bin/java -Xfuture -Djava.security.policy=/java/jck-dev/users3/dixonj/merlin-cup-build/unzip/JCK-runtime-14/tests/../lib/jck.policy -Djava.rmi.activation.port=57599 javasoft.sqe.tests.api.java.awt.Font.TransformAttribute.serial.InputTests
| ----------ref:(85/5905)----------
| Checking for JDK Version : 1.2
| Creating StreamObject from spec
| Setting the value of serial fields
| Converting the StreamObject to Object
| I/O error. Got exception:
| java.io.InvalidClassException: java.awt.font.TransformAttribute; Local class not compatible: stream classdesc serialVersionUID=3356247357827709530 local class serialVersionUID=-6989390531895433322
| at java.io.ObjectStreamClass.validateLocalClass(ObjectStreamClass.java:523)
| at java.io.ObjectStreamClass.setClass(ObjectStreamClass.java:567)
| at java.io.ObjectInputStream.inputClassDescriptor(ObjectInputStream.java:936)
| at java.io.ObjectInputStream.readObject(ObjectInputStream.java:366)
| at java.io.ObjectInputStream.readObject(ObjectInputStream.java:236)
| at java.io.ObjectInputStream.inputObject(ObjectInputStream.java:1186)
| at java.io.ObjectInputStream.readObject(ObjectInputStream.java:386)
| at java.io.ObjectInputStream.readObject(ObjectInputStream.java:236)
| at javasoft.sqe.serial.util.Convert.streamObjectToObject(Convert.java:60)
| at javasoft.sqe.tests.api.java.awt.Font.TransformAttribute.serial.InputTests.serial2002(InputTests.java:104)
| at java.lang.reflect.Method.invoke(Native Method)
| at javasoft.sqe.javatest.lib.MultiTest.invokeTestCase(MultiTest.java:409)
| at javasoft.sqe.javatest.lib.MultiTest.run(MultiTest.java:205)
| at javasoft.sqe.javatest.lib.MultiTest.run(MultiTest.java:137)
| at javasoft.sqe.tests.api.java.awt.Font.TransformAttribute.serial.InputTests.main(InputTests.java:42)
| Checking for JDK Version : 1.21
| Creating StreamObject from spec
| Setting the value of serial fields
| Converting the StreamObject to Object
| I/O error. Got exception:
| java.io.InvalidClassException: java.awt.font.TransformAttribute; Local class not compatible: stream classdesc serialVersionUID=3356247357827709530 local class serialVersionUID=-6989390531895433322
| at java.io.ObjectStreamClass.validateLocalClass(ObjectStreamClass.java:523)
| at java.io.ObjectStreamClass.setClass(ObjectStreamClass.java:567)
| at java.io.ObjectInputStream.inputClassDescriptor(ObjectInputStream.java:936)
| at java.io.ObjectInputStream.readObject(ObjectInputStream.java:366)
| at java.io.ObjectInputStream.readObject(ObjectInputStream.java:236)
| at java.io.ObjectInputStream.inputObject(ObjectInputStream.java:1186)
| at java.io.ObjectInputStream.readObject(ObjectInputStream.java:386)
| at java.io.ObjectInputStream.readObject(ObjectInputStream.java:236)
| at javasoft.sqe.serial.util.Convert.streamObjectToObject(Convert.java:60)
| at javasoft.sqe.tests.api.java.awt.Font.TransformAttribute.serial.InputTests.serial2002(InputTests.java:104)
| at java.lang.reflect.Method.invoke(Native Method)
| at javasoft.sqe.javatest.lib.MultiTest.invokeTestCase(MultiTest.java:409)
| at javasoft.sqe.javatest.lib.MultiTest.run(MultiTest.java:205)
| at javasoft.sqe.javatest.lib.MultiTest.run(MultiTest.java:137)
| at javasoft.sqe.tests.api.java.awt.Font.TransformAttribute.serial.InputTests.main(InputTests.java:42)
| Checking for JDK Version : 1.22
| Creating StreamObject from spec
| Setting the value of serial fields
| Converting the StreamObject to Object
| I/O error. Got exception:
| java.io.InvalidClassException: java.awt.font.TransformAttribute; Local class not compatible: stream classdesc serialVersionUID=3356247357827709530 local class serialVersionUID=-6989390531895433322
| at java.io.ObjectStreamClass.validateLocalClass(ObjectStreamClass.java:523)
| at java.io.ObjectStreamClass.setClass(ObjectStreamClass.java:567)
| at java.io.ObjectInputStream.inputClassDescriptor(ObjectInputStream.java:936)
| at java.io.ObjectInputStream.readObject(ObjectInputStream.java:366)
| at java.io.ObjectInputStream.readObject(ObjectInputStream.java:236)
| at java.io.ObjectInputStream.inputObject(ObjectInputStream.java:1186)
| at java.io.ObjectInputStream.readObject(ObjectInputStream.java:386)
| at java.io.ObjectInputStream.readObject(ObjectInputStream.java:236)
| at javasoft.sqe.serial.util.Convert.streamObjectToObject(Convert.java:60)
| at javasoft.sqe.tests.api.java.awt.Font.TransformAttribute.serial.InputTests.serial2002(InputTests.java:104)
| at java.lang.reflect.Method.invoke(Native Method)
| at javasoft.sqe.javatest.lib.MultiTest.invokeTestCase(MultiTest.java:409)
| at javasoft.sqe.javatest.lib.MultiTest.run(MultiTest.java:205)
| at javasoft.sqe.javatest.lib.MultiTest.run(MultiTest.java:137)
| at javasoft.sqe.tests.api.java.awt.Font.TransformAttribute.serial.InputTests.main(InputTests.java:42)
| Checking for JDK Version : 1.3
| Creating StreamObject from spec
| Setting the value of serial fields
| Converting the StreamObject to Object
| I/O error. Got exception:
| java.io.InvalidClassException: java.awt.font.TransformAttribute; Local class not compatible: stream classdesc serialVersionUID=3356247357827709530 local class serialVersionUID=-6989390531895433322
| at java.io.ObjectStreamClass.validateLocalClass(ObjectStreamClass.java:523)
| at java.io.ObjectStreamClass.setClass(ObjectStreamClass.java:567)
| at java.io.ObjectInputStream.inputClassDescriptor(ObjectInputStream.java:936)
| at java.io.ObjectInputStream.readObject(ObjectInputStream.java:366)
| at java.io.ObjectInputStream.readObject(ObjectInputStream.java:236)
| at java.io.ObjectInputStream.inputObject(ObjectInputStream.java:1186)
| at java.io.ObjectInputStream.readObject(ObjectInputStream.java:386)
| at java.io.ObjectInputStream.readObject(ObjectInputStream.java:236)
| at javasoft.sqe.serial.util.Convert.streamObjectToObject(Convert.java:60)
| at javasoft.sqe.tests.api.java.awt.Font.TransformAttribute.serial.InputTests.serial2002(InputTests.java:104)
| at java.lang.reflect.Method.invoke(Native Method)
| at javasoft.sqe.javatest.lib.MultiTest.invokeTestCase(MultiTest.java:409)
| at javasoft.sqe.javatest.lib.MultiTest.run(MultiTest.java:205)
| at javasoft.sqe.javatest.lib.MultiTest.run(MultiTest.java:137)
| at javasoft.sqe.tests.api.java.awt.Font.TransformAttribute.serial.InputTests.main(InputTests.java:42)
| serial2002 failed.
| ----------log:(2/98)----------
| serial2002: Failed. FAILED
| STATUS:Failed.tests: 1; failed: 1; first test case failure: serial2002
| result: Failed. tests: 1; failed: 1; first test case failure: serial2002
|
|
| test result: Failed. tests: 1; failed: 1; first test case failure: serial2002</XMP></BODY></HTML>
|
| api/java_awt/GridBagLayout/serial/index.html#Input:
|
| <!DOCTYPE HTML PUBLIC "-//W3C//DTD HTML 4.0 Transitional//EN">
| <HTML><HEAD>
| <META content="text/html; charset=windows-1252" http-equiv=Content-Type>
| <META content="MSHTML 5.00.2013.1310" name=GENERATOR></HEAD>
| <BODY><XMP>#Test Results (version 2)
| #Sat Jun 24 06:31:13 PDT 2000
| #checksum:13252be74bab4ba9
| #-----testdescription-----
| $file=/java/jck-dev/users3/dixonj/merlin-cup-build/unzip/JCK-runtime-14/tests/api/java_awt/GridBagLayout/serial/index.html
| $root=/java/jck-dev/users3/dixonj/merlin-cup-build/unzip/JCK-runtime-14/tests
| executeClass=javasoft.sqe.tests.api.java.awt.GridBagLayout.serial.InputTests
| id=Input
| keywords=positive runtime
| source=InputTests.java
| title=GridBagLayout InputTests tests
|
| #-----environment-----
| DISPLAY=bonesbrigade:0.0
| ExecJCKTestOtherJVMCmd=javasoft.sqe.javatest.lib.ExecJCKTestOtherJVMCmd
| command.testExecute=$ExecJCKTestO
- duplicates
-
JDK-4352257 jck_regr: api/java_awt/serialization/descriptions.html#Panel
-
- Closed
-
-
JDK-4352271 jck_regr: api/java_awt/serialization/descriptions.html#GridBagLayout
-
- Closed
-
-
JDK-4350466 Serialization of java.awt.GridBagLayout has compatibility problem
-
- Closed
-
-
JDK-4351843 java.awt.font.TransformAttribute lacks serialVersionUID
-
- Closed
-