During Regression test with jdk1.4 beta b36 on Solaris IA 2.7 in de_DE locale, java/util/Locale/LocaleTest.java failed.
Below is a part of the message:
#section:main
----------messages:(3/119)----------
command: main LocaleTest
reason: Assumed action based on file name: run main LocaleTest
elapsed time (seconds): 1.948
----------System.out:(11/360)----------
LocaleTest {
Test4143951 Passed
Test4105828 Passed
TestEuroSupport Passed
TestThaiCurrencyFormat Passed
TestISO3Fallback Passed
TestGetLangsAndCountries Passed
TestNullDefault Passed
Test4147552 {
English display-name mismatch: expected Norwegian (Norway), got Norwegisch (Norwegen)
Uncaught exception thrown in test method Test4147552
----------System.err:(15/620)----------
java.lang.RuntimeException: Uncaught exception thrown in test method Test4147552
at LocaleTestFmwk.err(LocaleTestFmwk.java:174)
at LocaleTestFmwk.errln(LocaleTestFmwk.java:179)
at LocaleTestFmwk.run(LocaleTestFmwk.java:127)
at LocaleTest.main(LocaleTest.java:154)
at java.lang.reflect.Method.invoke(Native Method)
at javasoft.sqe.javatest.regtest.MainWrapper$MainThread.run(MainWrapper.java:94)
at java.lang.Thread.run(Thread.java:488)
JavaTest Message: Test threw exception: java.lang.RuntimeException: Uncaught exception thrown in test method Test4147552
JavaTest Message: shutting down test
STATUS:Failed.
result: Failed. Execution failed
test result: Failed. Execution failed
This test failed with jdk1.4 beta b38 on Solaris SPARC 2.7 in th_TH locale, Win2000 in zh_TW locale as well as WinNT4 SP6 in iw_IL enabled locale.
keiko.nakayama@Eng 2000-11-07
----------
Veryfied with Jdk1.4 beta b49 on NT4 English. The test worked as expected
keiko.nakayama@Eng 2001-01-29
Below is a part of the message:
#section:main
----------messages:(3/119)----------
command: main LocaleTest
reason: Assumed action based on file name: run main LocaleTest
elapsed time (seconds): 1.948
----------System.out:(11/360)----------
LocaleTest {
Test4143951 Passed
Test4105828 Passed
TestEuroSupport Passed
TestThaiCurrencyFormat Passed
TestISO3Fallback Passed
TestGetLangsAndCountries Passed
TestNullDefault Passed
Test4147552 {
English display-name mismatch: expected Norwegian (Norway), got Norwegisch (Norwegen)
Uncaught exception thrown in test method Test4147552
----------System.err:(15/620)----------
java.lang.RuntimeException: Uncaught exception thrown in test method Test4147552
at LocaleTestFmwk.err(LocaleTestFmwk.java:174)
at LocaleTestFmwk.errln(LocaleTestFmwk.java:179)
at LocaleTestFmwk.run(LocaleTestFmwk.java:127)
at LocaleTest.main(LocaleTest.java:154)
at java.lang.reflect.Method.invoke(Native Method)
at javasoft.sqe.javatest.regtest.MainWrapper$MainThread.run(MainWrapper.java:94)
at java.lang.Thread.run(Thread.java:488)
JavaTest Message: Test threw exception: java.lang.RuntimeException: Uncaught exception thrown in test method Test4147552
JavaTest Message: shutting down test
STATUS:Failed.
result: Failed. Execution failed
test result: Failed. Execution failed
This test failed with jdk1.4 beta b38 on Solaris SPARC 2.7 in th_TH locale, Win2000 in zh_TW locale as well as WinNT4 SP6 in iw_IL enabled locale.
keiko.nakayama@Eng 2000-11-07
----------
Veryfied with Jdk1.4 beta b49 on NT4 English. The test worked as expected
keiko.nakayama@Eng 2001-01-29