In GlobalSuite core/BreakIterator tests, test LineBreakIterator (BreakIterator.getLineInstance) failed, the report is attached.
The same test passed in JDK1.3, and in Ladybird b13, both Win, Solaris.
The test failed in Merlin b48 and earlier builds, in he and ar locale.
#Test Results (version 2)
#Wed Jan 24 13:51:47 PST 2001
#checksum:3c0cb124debb26a3
#-----testdescription-----
$file=/home/minchit/i18n_ws/GlobalSuite/test/core/BreakIterator/LineBreakIterator1.java
$root=/home/minchit/i18n_ws/GlobalSuite
run=USER_SPECIFIED build BreakIteratorTest\nUSER_SPECIFIED main LineBreakIterator1\n
source=LineBreakIterator1.java
title=
#-----environment-----
#-----testresult-----
description=file:///home/minchit/i18n_ws/GlobalSuite/test/core/BreakIterator/LineBreakIterator1.java
end=Wed Jan 24 13:51:47 PST 2001
environment=regtest
execStatus=Failed. Execution failed: `main' threw exception: java.lang.RuntimeException: LineBreakIterator: doesn't match output and golden file.
javatestOS=SunOS 5.7 (sparc)
javatestVersion=JT_2.1.4b05
script=com.sun.javatest.regtest.RegressionScript
sections=script_messages build build main
start=Wed Jan 24 13:51:42 PST 2001
status=Failed. Execution failed: `main' threw exception: java.lang.RuntimeException: LineBreakIterator: doesn't match output and golden file.
test=test/core/BreakIterator/LineBreakIterator1.java
work=/home/minchit/i18n_ws/GlobalSuite/JTwork/test/core/BreakIterator
#section:script_messages
----------messages:(1/77)----------
JDK under test: java full version "1.4.0-beta-b48" (/home/minchit/jdk1.4b48)
#section:build
----------messages:(3/125)----------
command: build BreakIteratorTest
reason: User specified action: run build BreakIteratorTest
elapsed time (seconds): 0.0090
result: Passed. No need to compile: BreakIteratorTest.java
#section:build
----------messages:(3/105)----------
command: build LineBreakIterator1
reason: Named class compiled on demand
elapsed time (seconds): 0.0060
result: Passed. No need to compile: LineBreakIterator1.java
#section:main
----------messages:(3/123)----------
command: main LineBreakIterator1
reason: User specified action: run main LineBreakIterator1
elapsed time (seconds): 4.804
----------System.out:(9/1910)*----------
KIM: \u05d1\u05dc \u05d1\u05d4\u05d4." \u05d6\u05d1\u05dc \u05d6\u05d1 "\u2017\u05d6\u05dd" \u05d1 \u05d3 \u05d6 \u05d6 \u05d1\u05dd\u05d4 7.1 \u05d3\u05d1\u05dd \u05d6\u05d1 \u05d3.
\u05d3\u05d4 \u05d1\u05d3\u05d6 \u05d4 \u05dd\u05d1 \u05d3 \u05d5 \u05d1\u05d6 10 \u05d3\u05d1\u05dd \u05d6\u05d1 \u05d3\u05dd\u2017\u05dd \u05dd \u05d3 2003. \u05d6 "\u2017\u05d6\u05dd" \u05d4 \u05d5 \u05d1\u05d4\u05d3\u05d6\\.
\u05dd \u05d1\u05d3 \u05d1\u05d4\u05d4 \u05d6\u05d1 \u05d1\u05d1\u2017\u05d6\u05d4\u05dd \u05d6 \u05d1\u05d3\u05d6\u05dc \u05d6\u05d1 \u05d1\u05dc \u05d3 \u05d1\u05d3\u05d6\u05dd\u05d4 \u05d1\u05d3\u05d4\u05d1\u05dd\u05d4. \u05d6\u05d3\u05d3 \u05d1 \u2017 \u05dd\u05d5 \u05d4 \u05dd.
\u2017\u05d6\u05dd" \u05dd\u2017 \u05d1\u05d1 \u05d1\u05d5\u05d1 \u05d1\u05d3\u05d1 \u05d1\u05dc \u05d1\u05d6\u05d1 "\u05dd \u05dd \u05d3" \u05d1\u05d6\u05dd \u05d1\u05d1\u05d3\u05d1 \u05d1\u05d1\u2017\u05d6\u05d4\u05dd \u05d6\u05d1 \u05d1\u05d3\u05d1 \u2017. \u05d6\u05d1 \u05d4\u05dd \u05d4 \u05d1\u05d3\u05dd \u05d1\u05d3 \u05d1.
\u05d1\u05dd\u05d4 \u05dd \u05d1\u05d3\u05d1 \u05d1\u05d3\u05d4\u05d6. \u05d6\u05d3 \u05d1 \u05d6 \u05d6 \u05d1\u05dd\u05d4 \u05d1\u05dd \u2017\u05d4 \u05dd \u05dd \u05d6 \u05d1 \u05d3\u05d4 \u05d3 \u05d3\u05dc \u05dd\u05d1 \u05d4\u05d3\u05d6 \u05d6\u05d1 \u05d1 \u05d4 \u05d3\u05d6.
\u05d6\u05dd\u0092 \u05d6\u05d1\u05d3\u05d1\u05d6\u05d3 \u05d1\u05dc \u05d1\u05d4\u05d4." \u05d6\u05d1\u05dc \u05d6\u05d1 "\u2017\u05d6\u05dd" \u05d1 \u05d3 \u05d6 \u05d6 \u05d1\u05dd\u05d4 7.1 \u05d3\u05d1\u05dd \u05d6\u05d1 \u05d3\u05dd\u2017\u05dd \u05dd \u05d3 1998 \u05dd \u05d4\u05d5 .
\u05d4 15 \u05dd \u05d1\u05d3 \u05d4 \u05d3 1997. \u2017\u05d3 \u05d3\u05d4 \u05d1\u05d3\u05d6 \u05d4 \u05dd\u05d1 \u05d3 \u05d5 \u05d1\u05d6 10 \u05d3\u05d1\u05dd \u05d6\u05d1 \u05d3\u05dd\u2017\u05dd \u05dd \u05d3 2003. \u05d6 "\u2017\u05d6\u05dd" \u05d4 \u05d5 \u05d1\u05d4\u05d3\u05d6.
292 : 296
----------System.err:(12/709)----------
java.lang.RuntimeException: LineBreakIterator: doesn't match output and golden file.
at BreakIteratorTest.test(BreakIteratorTest.java:156)
at BreakIteratorTest.<init>(BreakIteratorTest.java:38)
at LineBreakIterator1.main(LineBreakIterator1.java:16)
at java.lang.reflect.Method.invoke(Native Method)
at com.sun.javatest.regtest.MainWrapper$MainThread.run(MainWrapper.java:94)
at java.lang.Thread.run(Thread.java:579)
JavaTest Message: Test threw exception: java.lang.RuntimeException: LineBreakIterator: doesn't match output and golden file.
JavaTest Message: shutting down test
STATUS:Failed.`main' threw exception: java.lang.RuntimeException: LineBreakIterator: doesn't match output and golden file.
result: Failed. Execution failed: `main' threw exception: java.lang.RuntimeException: LineBreakIterator: doesn't match output and golden file.
test result: Failed. Execution failed: `main' threw exception: java.lang.RuntimeException: LineBreakIterator: doesn't match output and golden file.
The same test passed in JDK1.3, and in Ladybird b13, both Win, Solaris.
The test failed in Merlin b48 and earlier builds, in he and ar locale.
#Test Results (version 2)
#Wed Jan 24 13:51:47 PST 2001
#checksum:3c0cb124debb26a3
#-----testdescription-----
$file=/home/minchit/i18n_ws/GlobalSuite/test/core/BreakIterator/LineBreakIterator1.java
$root=/home/minchit/i18n_ws/GlobalSuite
run=USER_SPECIFIED build BreakIteratorTest\nUSER_SPECIFIED main LineBreakIterator1\n
source=LineBreakIterator1.java
title=
#-----environment-----
#-----testresult-----
description=file:///home/minchit/i18n_ws/GlobalSuite/test/core/BreakIterator/LineBreakIterator1.java
end=Wed Jan 24 13:51:47 PST 2001
environment=regtest
execStatus=Failed. Execution failed: `main' threw exception: java.lang.RuntimeException: LineBreakIterator: doesn't match output and golden file.
javatestOS=SunOS 5.7 (sparc)
javatestVersion=JT_2.1.4b05
script=com.sun.javatest.regtest.RegressionScript
sections=script_messages build build main
start=Wed Jan 24 13:51:42 PST 2001
status=Failed. Execution failed: `main' threw exception: java.lang.RuntimeException: LineBreakIterator: doesn't match output and golden file.
test=test/core/BreakIterator/LineBreakIterator1.java
work=/home/minchit/i18n_ws/GlobalSuite/JTwork/test/core/BreakIterator
#section:script_messages
----------messages:(1/77)----------
JDK under test: java full version "1.4.0-beta-b48" (/home/minchit/jdk1.4b48)
#section:build
----------messages:(3/125)----------
command: build BreakIteratorTest
reason: User specified action: run build BreakIteratorTest
elapsed time (seconds): 0.0090
result: Passed. No need to compile: BreakIteratorTest.java
#section:build
----------messages:(3/105)----------
command: build LineBreakIterator1
reason: Named class compiled on demand
elapsed time (seconds): 0.0060
result: Passed. No need to compile: LineBreakIterator1.java
#section:main
----------messages:(3/123)----------
command: main LineBreakIterator1
reason: User specified action: run main LineBreakIterator1
elapsed time (seconds): 4.804
----------System.out:(9/1910)*----------
KIM: \u05d1\u05dc \u05d1\u05d4\u05d4." \u05d6\u05d1\u05dc \u05d6\u05d1 "\u2017\u05d6\u05dd" \u05d1 \u05d3 \u05d6 \u05d6 \u05d1\u05dd\u05d4 7.1 \u05d3\u05d1\u05dd \u05d6\u05d1 \u05d3.
\u05d3\u05d4 \u05d1\u05d3\u05d6 \u05d4 \u05dd\u05d1 \u05d3 \u05d5 \u05d1\u05d6 10 \u05d3\u05d1\u05dd \u05d6\u05d1 \u05d3\u05dd\u2017\u05dd \u05dd \u05d3 2003. \u05d6 "\u2017\u05d6\u05dd" \u05d4 \u05d5 \u05d1\u05d4\u05d3\u05d6\\.
\u05dd \u05d1\u05d3 \u05d1\u05d4\u05d4 \u05d6\u05d1 \u05d1\u05d1\u2017\u05d6\u05d4\u05dd \u05d6 \u05d1\u05d3\u05d6\u05dc \u05d6\u05d1 \u05d1\u05dc \u05d3 \u05d1\u05d3\u05d6\u05dd\u05d4 \u05d1\u05d3\u05d4\u05d1\u05dd\u05d4. \u05d6\u05d3\u05d3 \u05d1 \u2017 \u05dd\u05d5 \u05d4 \u05dd.
\u2017\u05d6\u05dd" \u05dd\u2017 \u05d1\u05d1 \u05d1\u05d5\u05d1 \u05d1\u05d3\u05d1 \u05d1\u05dc \u05d1\u05d6\u05d1 "\u05dd \u05dd \u05d3" \u05d1\u05d6\u05dd \u05d1\u05d1\u05d3\u05d1 \u05d1\u05d1\u2017\u05d6\u05d4\u05dd \u05d6\u05d1 \u05d1\u05d3\u05d1 \u2017. \u05d6\u05d1 \u05d4\u05dd \u05d4 \u05d1\u05d3\u05dd \u05d1\u05d3 \u05d1.
\u05d1\u05dd\u05d4 \u05dd \u05d1\u05d3\u05d1 \u05d1\u05d3\u05d4\u05d6. \u05d6\u05d3 \u05d1 \u05d6 \u05d6 \u05d1\u05dd\u05d4 \u05d1\u05dd \u2017\u05d4 \u05dd \u05dd \u05d6 \u05d1 \u05d3\u05d4 \u05d3 \u05d3\u05dc \u05dd\u05d1 \u05d4\u05d3\u05d6 \u05d6\u05d1 \u05d1 \u05d4 \u05d3\u05d6.
\u05d6\u05dd\u0092 \u05d6\u05d1\u05d3\u05d1\u05d6\u05d3 \u05d1\u05dc \u05d1\u05d4\u05d4." \u05d6\u05d1\u05dc \u05d6\u05d1 "\u2017\u05d6\u05dd" \u05d1 \u05d3 \u05d6 \u05d6 \u05d1\u05dd\u05d4 7.1 \u05d3\u05d1\u05dd \u05d6\u05d1 \u05d3\u05dd\u2017\u05dd \u05dd \u05d3 1998 \u05dd \u05d4\u05d5 .
\u05d4 15 \u05dd \u05d1\u05d3 \u05d4 \u05d3 1997. \u2017\u05d3 \u05d3\u05d4 \u05d1\u05d3\u05d6 \u05d4 \u05dd\u05d1 \u05d3 \u05d5 \u05d1\u05d6 10 \u05d3\u05d1\u05dd \u05d6\u05d1 \u05d3\u05dd\u2017\u05dd \u05dd \u05d3 2003. \u05d6 "\u2017\u05d6\u05dd" \u05d4 \u05d5 \u05d1\u05d4\u05d3\u05d6.
292 : 296
----------System.err:(12/709)----------
java.lang.RuntimeException: LineBreakIterator: doesn't match output and golden file.
at BreakIteratorTest.test(BreakIteratorTest.java:156)
at BreakIteratorTest.<init>(BreakIteratorTest.java:38)
at LineBreakIterator1.main(LineBreakIterator1.java:16)
at java.lang.reflect.Method.invoke(Native Method)
at com.sun.javatest.regtest.MainWrapper$MainThread.run(MainWrapper.java:94)
at java.lang.Thread.run(Thread.java:579)
JavaTest Message: Test threw exception: java.lang.RuntimeException: LineBreakIterator: doesn't match output and golden file.
JavaTest Message: shutting down test
STATUS:Failed.`main' threw exception: java.lang.RuntimeException: LineBreakIterator: doesn't match output and golden file.
result: Failed. Execution failed: `main' threw exception: java.lang.RuntimeException: LineBreakIterator: doesn't match output and golden file.
test result: Failed. Execution failed: `main' threw exception: java.lang.RuntimeException: LineBreakIterator: doesn't match output and golden file.
- duplicates
-
JDK-4449572 linebreaking failed on ar_SA and zh_TW with jdk1.4
-
- Closed
-