-
Bug
-
Resolution: Fixed
-
P2
-
1.4.1
-
beta
-
itanium
-
windows_xp
-
Verified
Filed By : J2SE-SQA [###@###.###
JDK : J2SE 1.4.1-test-test
JCK : jck1.4-b17
Platform[s] : Windows XP 64 bit
switch/Mode : -Xinterpreter -Xfuture
JCK test owner : http://javaweb.eng/jck/usr/owners.jto
Falling test[s]: api/java_awt/java2d/awt/Graphics2D/index.html#DrawImageTesttestCase1
api/java_awt/java2d/image/AffineTransformOp/index.html#FilterTest1
Test source location:
=====================
/net/jdk/export/disk8/local.java/jck1.4/JCK-runtime-14/tests/api/java_awt/java2d/awt/Graphics2D/DrawImageTest.java
/net/jdk/export/disk8/local.java/jck1.4/JCK-runtime-14/tests/api/java_awt/java2d/image/AffineTransformOp/FilterTest1.java
jtr file location:
==================
/net/jtgb4u4c.eng/export/sail15/results/hopper/PIT/itanium/jck14/win/workDir/api/java_awt/java2d/awt/Graphics2D/index_DrawImageTesttestCase1.jtr
/net/jtgb4u4c.eng/export/sail15/results/hopper/PIT/itanium/jck14/win/workDir/api/java_awt/java2d/image/AffineTransformOp/index_FilterTest1.jtr
How to reproduce:
=================
Run the following script (you may need to change JCK and JDK variables):
--- script start ---
#!/bin/sh
JCK=I:/sail16/JCK/jck14/JCK-runtime-14
JDK=c:/j2sdk1.4.1
flags="-Xfuture -verify -Xinterpreter -Xmx256m -Djava.security.policy=${JCK}/lib/jck.policy"
echo "### api/java_awt/java2d/awt/Graphics2D/index.html#DrawImageTesttestCase1"
${JDK}/bin/java -classpath "${JCK}/classes;${JCK}/javatest.jar" ${flags} javasoft.sqe.tests.api.java.awt.java2d.awt.Graphics2D.DrawImageTest -TestCaseID testCase1
res=$?
if [ "${res}" != "95" ]; then
echo "*** Test FAILED: ${res}"
else
echo "*** Test PASSED"
fi
echo "### api/java_awt/java2d/image/AffineTransformOp/index.html#FilterTest1"
${JDK}/bin/java -classpath "${JCK}/classes;${JCK}/javatest.jar" ${flags} javasoft.sqe.tests.api.java.awt.java2d.image.AffineTransformOp.FilterTest1
res=$?
if [ "${res}" != "95" ]; then
echo "*** Test FAILED: ${res}"
else
echo "*** Test PASSED"
fi
--- script end ---
Test output:
============
### api/java_awt/java2d/awt/Graphics2D/index.html#DrawImageTesttestCase1
*** Test FAILED: 128
### api/java_awt/java2d/image/AffineTransformOp/index.html#FilterTest1
----------------------------------------------------------------
AssertionTest Report
----------------------------------------------------------------
Method Name : public final java.awt.image.BufferedImage java.awt.image.AffineTransformOp.filter(java.awt.image.BufferedImage,java.awt.image.BufferedImage)
Class Name : class java.awt.image.AffineTransformOp
----------------------------------------------------------------
*** Test FAILED: 128
Test output (build "1.4.1-MuraliKrishna-ia64-xp-build", May 7)
==============================================================
### api/java_awt/java2d/awt/Graphics2D/index.html#DrawImageTesttestCase1
An unexpected exception has been detected in native code outside the VM.
Unexpected Signal : EXCEPTION_ACCESS_VIOLATION occurred at PC=0xE90125A0
Function=[Unknown.]
Library=C:\j2sdk1.4.1\bin\awt.dll
NOTE: We are unable to locate the function name symbol for the error
just occurred. Please refer to release documentation for possible
reason and solutions.
Current Java thread:
at sun.awt.image.ImagingLib.transformBI(Native Method)
at sun.awt.image.ImagingLib.filter(ImagingLib.java:202)
at java.awt.image.AffineTransformOp.filter(AffineTransformOp.java:262)
at sun.java2d.pipe.DrawImage.transformImage(DrawImage.java:304)
at sun.java2d.pipe.DrawImage.transformImage(DrawImage.java:832)
at sun.java2d.SunGraphics2D.drawImage(SunGraphics2D.java:2935)
at javasoft.sqe.tests.api.java.awt.java2d.awt.Graphics2D.DrawImageTest.testCase1(DrawImageTest.java:117)
at sun.reflect.NativeMethodAccessorImpl.invoke0(Native Method)
at sun.reflect.NativeMethodAccessorImpl.invoke(NativeMethodAccessorImpl.java:39)
at sun.reflect.DelegatingMethodAccessorImpl.invoke(DelegatingMethodAccessorImpl.java:25)
at java.lang.reflect.Method.invoke(Method.java:324)
at javasoft.sqe.javatest.lib.MultiTest.invokeTestCase(MultiTest.java:397)
at javasoft.sqe.javatest.lib.MultiTest.run(MultiTest.java:193)
at javasoft.sqe.javatest.lib.MultiTest.run(MultiTest.java:125)
at javasoft.sqe.tests.api.java.awt.java2d.awt.Graphics2D.DrawImageTest.main(DrawImageTest.java:71)
Dynamic libraries:
0x0000000000400000 - 0x0000000000414000 c:\j2sdk1.4.1\bin\java.EXE
0x0000000077E80000 - 0x0000000077FFC000 C:\WINDOWS\System32\ntdll.dll
0x0000000077CA0000 - 0x0000000077E78000 C:\WINDOWS\system32\kernel32.dll
0x0000000077B10000 - 0x0000000077C9A000 C:\WINDOWS\system32\ADVAPI32.dll
0x0000000077790000 - 0x000000007798C000 C:\WINDOWS\system32\RPCRT4.dll
0x00000000775B0000 - 0x00000000776A2000 C:\WINDOWS\system32\MSVCRT.dll
0x0000000008000000 - 0x0000000008244000 c:\j2sdk1.4.1\bin\server\jvm.dll
0x0000000077990000 - 0x0000000077B04000 C:\WINDOWS\system32\USER32.dll
0x00000000776B0000 - 0x000000007778A000 C:\WINDOWS\system32\GDI32.dll
0x0000000074F10000 - 0x0000000074F92000 C:\WINDOWS\System32\WINMM.dll
0x0000000010000000 - 0x0000000010016000 c:\j2sdk1.4.1\bin\hpi.dll
0x000006FBFFB20000 - 0x000006FBFFB44000 c:\j2sdk1.4.1\bin\verify.dll
0x000006FBFFAC0000 - 0x000006FBFFB14000 c:\j2sdk1.4.1\bin\java.dll
0x000006FBFFA90000 - 0x000006FBFFAB8000 c:\j2sdk1.4.1\bin\zip.dll
0x000006FBE8F30000 - 0x000006FBE91B6000 C:\j2sdk1.4.1\bin\awt.dll
0x000000006D2A0000 - 0x000000006D314000 C:\WINDOWS\System32\WINSPOOL.DRV
0x0000000073C10000 - 0x0000000073C66000 C:\WINDOWS\System32\IMM32.dll
0x0000000076070000 - 0x000000007647A000 C:\WINDOWS\system32\ole32.dll
0x000006FBE8E20000 - 0x000006FBE8F06000 C:\j2sdk1.4.1\bin\fontmanager.dll
0x0000000075270000 - 0x000000007529E000 C:\WINDOWS\system32\imagehlp.dll
0x0000000060A20000 - 0x0000000060C1A000 C:\WINDOWS\system32\DBGHELP.dll
0x0000000077590000 - 0x00000000775A8000 C:\WINDOWS\system32\VERSION.dll
0x0000000075100000 - 0x000000007511E000 C:\WINDOWS\System32\PSAPI.DLL
0x0000000000000000 - 0x0000000000000000
0x0000000000000000 - 0x0000000000000000
0x0000000000000000 - 0x0000000000000000
0x0000000000000000 - 0x0000000000000000
0x0000000000000000 - 0x0000000000000000
0x0000000000000000 - 0x0000000000000000
0x0000000000000000 - 0x0000000000000000
0x0000000000000000 - 0x0000000000014000 c:\j2sdk1.4.1\bin\java.EXE
0x0000000000000000 - 0x0000000000000000
0x0000000000000000 - 0x0000000000000000
0x0000000000000000 - 0x0000000000000000
0x0000000000000000 - 0x0000000000014000 c:\j2sdk1.4.1\bin\java.EXE
0x0000000000000000 - 0x0000000000000000
0x0000000000000000 - 0x0000000000000000
0x0000000000000000 - 0x0000000000000000
0x0000000000000000 - 0x0000000000000000
0x0000000000000000 - 0x0000000000000000
0x0000000000000000 - 0x0000000000000000
0x0000000000000000 - 0x0000000000000000
0x0000000000000000 - 0x0000000000000000
0x0000000000000000 - 0x0000000000000000
0x0000000000000000 - 0x0000000000000000
0x0000000000000000 - 0x0000000000000000
Local Time = Wed May 08 08:30:42 2002
Elapsed Time = 2
#
# The exception above was detected in native code outside the VM
#
# Java VM: Java HotSpot(TM) 64-Bit Core VM (1.4.1-MuraliKrishna-ia64-xp-build-12 interpreted mode)
#
# An error report file has been saved as hs_err_pid5372.log.
# Please refer to the file for further information.
#
*** Test FAILED: 1
### api/java_awt/java2d/image/AffineTransformOp/index.html#FilterTest1
----------------------------------------------------------------
AssertionTest Report
----------------------------------------------------------------
Method Name : public final java.awt.image.BufferedImage java.awt.image.AffineTransformOp.filter(java.awt.image.BufferedImage,java.awt.image.BufferedImage)
Class Name : class java.awt.image.AffineTransformOp
----------------------------------------------------------------
An unexpected exception has been detected in native code outside the VM.
Unexpected Signal : EXCEPTION_ACCESS_VIOLATION occurred at PC=0xE9012750
Function=[Unknown.]
Library=C:\j2sdk1.4.1\bin\awt.dll
NOTE: We are unable to locate the function name symbol for the error
just occurred. Please refer to release documentation for possible
reason and solutions.
Current Java thread:
at sun.awt.image.ImagingLib.transformBI(Native Method)
at sun.awt.image.ImagingLib.filter(ImagingLib.java:202)
at java.awt.image.AffineTransformOp.filter(AffineTransformOp.java:262)
at sun.reflect.NativeMethodAccessorImpl.invoke0(Native Method)
at sun.reflect.NativeMethodAccessorImpl.invoke(NativeMethodAccessorImpl.java:39)
at sun.reflect.DelegatingMethodAccessorImpl.invoke(DelegatingMethodAccessorImpl.java:25)
at java.lang.reflect.Method.invoke(Method.java:324)
at javasoft.sqe.javatest.lib.apitest.AssertionTest.runTest(AssertionTest.java:335)
at javasoft.sqe.javatest.lib.apitest.GridGenerator.executeTestCase(GridGenerator.java:110)
at javasoft.sqe.javatest.lib.apitest.GridGenerator.iterate(GridGenerator.java:85)
at javasoft.sqe.javatest.lib.apitest.GridGenerator.run(GridGenerator.java:44)
at javasoft.sqe.javatest.lib.apitest.AssertionTest.run(AssertionTest.java:80)
at javasoft.sqe.tests.api.java.awt.java2d.image.AffineTransformOp.FilterTest1.main(FilterTest1.java:58)
Dynamic libraries:
0x0000000000400000 - 0x0000000000414000 c:\j2sdk1.4.1\bin\java.EXE
0x0000000077E80000 - 0x0000000077FFC000 C:\WINDOWS\System32\ntdll.dll
0x0000000077CA0000 - 0x0000000077E78000 C:\WINDOWS\system32\kernel32.dll
0x0000000077B10000 - 0x0000000077C9A000 C:\WINDOWS\system32\ADVAPI32.dll
0x0000000077790000 - 0x000000007798C000 C:\WINDOWS\system32\RPCRT4.dll
0x00000000775B0000 - 0x00000000776A2000 C:\WINDOWS\system32\MSVCRT.dll
0x0000000008000000 - 0x0000000008244000 c:\j2sdk1.4.1\bin\server\jvm.dll
0x0000000077990000 - 0x0000000077B04000 C:\WINDOWS\system32\USER32.dll
0x00000000776B0000 - 0x000000007778A000 C:\WINDOWS\system32\GDI32.dll
0x0000000074F10000 - 0x0000000074F92000 C:\WINDOWS\System32\WINMM.dll
0x0000000010000000 - 0x0000000010016000 c:\j2sdk1.4.1\bin\hpi.dll
0x000006FBFFB20000 - 0x000006FBFFB44000 c:\j2sdk1.4.1\bin\verify.dll
0x000006FBFFAC0000 - 0x000006FBFFB14000 c:\j2sdk1.4.1\bin\java.dll
0x000006FBFFA90000 - 0x000006FBFFAB8000 c:\j2sdk1.4.1\bin\zip.dll
0x000006FBE8F30000 - 0x000006FBE91B6000 C:\j2sdk1.4.1\bin\awt.dll
0x000000006D2A0000 - 0x000000006D314000 C:\WINDOWS\System32\WINSPOOL.DRV
0x0000000073C10000 - 0x0000000073C66000 C:\WINDOWS\System32\IMM32.dll
0x0000000076070000 - 0x000000007647A000 C:\WINDOWS\system32\ole32.dll
0x0000000075270000 - 0x000000007529E000 C:\WINDOWS\system32\imagehlp.dll
0x0000000060A20000 - 0x0000000060C1A000 C:\WINDOWS\system32\DBGHELP.dll
0x0000000077590000 - 0x00000000775A8000 C:\WINDOWS\system32\VERSION.dll
0x0000000075100000 - 0x000000007511E000 C:\WINDOWS\System32\PSAPI.DLL
0x0000000000000000 - 0x0000000000000000
0x0000000000000000 - 0x0000000000000000
0x0000000000000000 - 0x0000000000014000 c:\j2sdk1.4.1\bin\java.EXE
0x0000000000000000 - 0x0000000000000000
0x0000000000000000 - 0x0000000000000000
0x0000000000000000 - 0x0000000000000000
0x0000000000000000 - 0x0000000000000000
0x0000000000000000 - 0x0000000000000000
0x0000000000000000 - 0x0000000000000000
0x0000000000000000 - 0x0000000000000000
0x0000000000000000 - 0x0000000000000000
0x0000000000000000 - 0x0000000000000000
0x0000000000000000 - 0x0000000000000000
0x0000000000000000 - 0x0000000000000000
0x0000000000000000 - 0x0000000000000000
0x0000000000000000 - 0x0000000000000000
0x0000000000000000 - 0x0000000000000000
0x0000000000000000 - 0x0000000000000000
0x0000000000000000 - 0x0000000000000000
0x0000000000000000 - 0x0000000000000000
0x0000000000000000 - 0x0000000000000000
0x0000000000000000 - 0x0000000000000000
Local Time = Wed May 08 08:30:44 2002
Elapsed Time = 1
#
# The exception above was detected in native code outside the VM
#
# Java VM: Java HotSpot(TM) 64-Bit Core VM (1.4.1-MuraliKrishna-ia64-xp-build-12 interpreted mode)
#
# An error report file has been saved as hs_err_pid4848.log.
# Please refer to the file for further information.
#
*** Test FAILED: 1
Specific Machine Info:
======================
Hostname: jcc-itanium-01
OS: Windows XP 64bit Edition