-
Bug
-
Resolution: Duplicate
-
P3
-
None
-
1.4.1
Tests failed : tests.vm.instr.dload_w.dload_w001.dload_w00101m1
tests.vm.instr.dstore_w.dstore_w005.dstore_w00501m1
gnu.testlet.java.net.MulticastSocket.MulticastSocketTest
MODE : -Xint
Platform : Itanium Linux (linux-ia64)
VM : server
To reproduce :
* Go to /net/jano.sfbay/export/disk20/GammaBase/Bugs/{BugID}
* execute rerun.sh
Failure : [dhana@vanadium2 failed]$ ./rerun.sh
......................................
[Enter:javasoft.sqe.tests.vm.instr.dload_w.dload_w001.dload_w00101m1.dload_w00101m1]
java.lang.StackOverflowError
at javasoft.sqe.tests.vm.instr.dload_w.dload_w001.dload_w00101m1.dload_w00101m1.main(/usr/re/jck/1.4/ws/jck1.4-b09/jck-tests-build/JCK-runtime-14/tests/vm/instr/dload_w/dload_w001/dload_w00101m1/dload_w00101m1.jasm)
at sun.reflect.NativeMethodAccessorImpl.invoke0(Native Method)
at sun.reflect.NativeMethodAccessorImpl.invoke(NativeMethodAccessorImpl.java:39)
at sun.reflect.DelegatingMethodAccessorImpl.invoke(DelegatingMethodAccessorImpl.java:25)
at java.lang.reflect.Method.invoke(Method.java:324)
at runThese$TestRunner.runTest(runThese.java:577)
at runThese$TestRunner.run(runThese.java:501)
#Failed - Exception: [java.lang.StackOverflowError]; javasoft.sqe.tests.vm.instr.dload_w.dload_w001.dload_w00101m1.dload_w00101m1; (1,0,1,0,0)
[Exit:javasoft.sqe.tests.vm.instr.dload_w.dload_w001.dload_w00101m1.dload_w00101m1]
......................................
[Enter:javasoft.sqe.tests.vm.instr.dstore_w.dstore_w005.dstore_w00501m1.dstore_w00501m1]
java.lang.StackOverflowError
at javasoft.sqe.tests.vm.instr.dstore_w.dstore_w005.dstore_w00501m1.dstore_w00501m1.main(/usr/re/jck/1.4/ws/jck1.4-b09/jck-tests-build/JCK-runtime-14/tests/vm/instr/dstore_w/dstore_w005/dstore_w00501m1/dstore_w00501m1.jasm)
at sun.reflect.NativeMethodAccessorImpl.invoke0(Native Method)
at sun.reflect.NativeMethodAccessorImpl.invoke(NativeMethodAccessorImpl.java:39)
at sun.reflect.DelegatingMethodAccessorImpl.invoke(DelegatingMethodAccessorImpl.java:25)
at java.lang.reflect.Method.invoke(Method.java:324)
at runThese$TestRunner.runTest(runThese.java:577)
at runThese$TestRunner.run(runThese.java:501)
#Failed - Exception: [java.lang.StackOverflowError]; javasoft.sqe.tests.vm.instr.dstore_w.dstore_w005.dstore_w00501m1.dstore_w00501m1; (1,0,1,0,0)
[Exit:javasoft.sqe.tests.vm.instr.dstore_w.dstore_w005.dstore_w00501m1.dstore_w00501m1]
......................................
[Enter:gnu.testlet.SimpleTestHarness -testbase /net/nanonano/export/VM/hopper/itanium/vsn/VM/testbase/runThese/tests/mauve/classes gnu.testlet.java.net.MulticastSocket.MulticastSocketTest]
FAIL: gnu.testlet.java.net.MulticastSocket.MulticastSocketTest: joinGroup() twice. (number 1)
1 of 14 tests failed
#Failed; gnu.testlet.SimpleTestHarness; (1,0,0,1,0)
[Exit:gnu.testlet.SimpleTestHarness -testbase /net/nanonano/export/VM/hopper/itanium/vsn/VM/testbase/runThese/tests/mauve/classes gnu.testlet.java.net.MulticastSocket.MulticastSocketTest]
runThese Finished
tests.vm.instr.dstore_w.dstore_w005.dstore_w00501m1
gnu.testlet.java.net.MulticastSocket.MulticastSocketTest
MODE : -Xint
Platform : Itanium Linux (linux-ia64)
VM : server
To reproduce :
* Go to /net/jano.sfbay/export/disk20/GammaBase/Bugs/{BugID}
* execute rerun.sh
Failure : [dhana@vanadium2 failed]$ ./rerun.sh
......................................
[Enter:javasoft.sqe.tests.vm.instr.dload_w.dload_w001.dload_w00101m1.dload_w00101m1]
java.lang.StackOverflowError
at javasoft.sqe.tests.vm.instr.dload_w.dload_w001.dload_w00101m1.dload_w00101m1.main(/usr/re/jck/1.4/ws/jck1.4-b09/jck-tests-build/JCK-runtime-14/tests/vm/instr/dload_w/dload_w001/dload_w00101m1/dload_w00101m1.jasm)
at sun.reflect.NativeMethodAccessorImpl.invoke0(Native Method)
at sun.reflect.NativeMethodAccessorImpl.invoke(NativeMethodAccessorImpl.java:39)
at sun.reflect.DelegatingMethodAccessorImpl.invoke(DelegatingMethodAccessorImpl.java:25)
at java.lang.reflect.Method.invoke(Method.java:324)
at runThese$TestRunner.runTest(runThese.java:577)
at runThese$TestRunner.run(runThese.java:501)
#Failed - Exception: [java.lang.StackOverflowError]; javasoft.sqe.tests.vm.instr.dload_w.dload_w001.dload_w00101m1.dload_w00101m1; (1,0,1,0,0)
[Exit:javasoft.sqe.tests.vm.instr.dload_w.dload_w001.dload_w00101m1.dload_w00101m1]
......................................
[Enter:javasoft.sqe.tests.vm.instr.dstore_w.dstore_w005.dstore_w00501m1.dstore_w00501m1]
java.lang.StackOverflowError
at javasoft.sqe.tests.vm.instr.dstore_w.dstore_w005.dstore_w00501m1.dstore_w00501m1.main(/usr/re/jck/1.4/ws/jck1.4-b09/jck-tests-build/JCK-runtime-14/tests/vm/instr/dstore_w/dstore_w005/dstore_w00501m1/dstore_w00501m1.jasm)
at sun.reflect.NativeMethodAccessorImpl.invoke0(Native Method)
at sun.reflect.NativeMethodAccessorImpl.invoke(NativeMethodAccessorImpl.java:39)
at sun.reflect.DelegatingMethodAccessorImpl.invoke(DelegatingMethodAccessorImpl.java:25)
at java.lang.reflect.Method.invoke(Method.java:324)
at runThese$TestRunner.runTest(runThese.java:577)
at runThese$TestRunner.run(runThese.java:501)
#Failed - Exception: [java.lang.StackOverflowError]; javasoft.sqe.tests.vm.instr.dstore_w.dstore_w005.dstore_w00501m1.dstore_w00501m1; (1,0,1,0,0)
[Exit:javasoft.sqe.tests.vm.instr.dstore_w.dstore_w005.dstore_w00501m1.dstore_w00501m1]
......................................
[Enter:gnu.testlet.SimpleTestHarness -testbase /net/nanonano/export/VM/hopper/itanium/vsn/VM/testbase/runThese/tests/mauve/classes gnu.testlet.java.net.MulticastSocket.MulticastSocketTest]
FAIL: gnu.testlet.java.net.MulticastSocket.MulticastSocketTest: joinGroup() twice. (number 1)
1 of 14 tests failed
#Failed; gnu.testlet.SimpleTestHarness; (1,0,0,1,0)
[Exit:gnu.testlet.SimpleTestHarness -testbase /net/nanonano/export/VM/hopper/itanium/vsn/VM/testbase/runThese/tests/mauve/classes gnu.testlet.java.net.MulticastSocket.MulticastSocketTest]
runThese Finished
- duplicates
-
JDK-4678363 LIN64: JCK1.4 lang/EXPR/expr131/expr13102/expr13102.html
-
- Closed
-