-
Bug
-
Resolution: Cannot Reproduce
-
P3
-
None
-
1.4.1
-
generic
-
generic
Running reliability test (using GlobalSuite/I18NBasher) for 24 hours, the following test failed with exception thrown:
test/unicode/surrogate/ObjectStreamSurrogateTest -> FAIL
---------------------------------- System.err ----------------------------
java.lang.reflect.InvocationTargetException
at sun.reflect.NativeMethodAccessorImpl.invoke0(Native Method)
at sun.reflect.NativeMethodAccessorImpl.invoke(NativeMethodAccessorImpl.java:39)
at sun.reflect.DelegatingMethodAccessorImpl.invoke(DelegatingMethodAccessorImpl.java:25)
at java.lang.reflect.Method.invoke(Method.java:324)
at lib.reliability.I18NBasher.run(I18NBasher.java:401)
at lib.reliability.I18NBasher.<init>(I18NBasher.java:84)
at lib.reliability.I18NBasher.main(I18NBasher.java:29)
Caused by: java.lang.RuntimeException: java.io.StreamCorruptedException: unexpected EOF in middle of data block
at ObjectStreamSurrogateTest.<init>(ObjectStreamSurrogateTest.java:69)
at ObjectStreamSurrogateTest.main(ObjectStreamSurrogateTest.java:75)
... 7 more
JDK : jre1.4.1-b13
Platform[s] : Windows 2000, Linux RedHat 7.2, Sol.9 (64bit)
Note: the same test passed in IA8 and Sol.8
Note: the same test passed in b06 (reliability ran last time)
When run in GlobalSuite, by specifying the specific test, test passed.
When tried with shorter period of time, test passed.
###@###.### 2002-05-30
=============================================================================
The latest GlobalSuite bundle gs13-b07.tar.gz can be found in
/net/sqesvr/export/i18n/i18n_hopper_ws/bundles/v1.3/b07
To run the specific test case after untar, cd to GlobalSuite,
sh run_gs.sh -jdk:[jdk] test/unicode/surrogate/ObjectStreamSurrogateTest.java
(the test case is also attached)
However this way won't reproduce the bug, the bug shows up only after running the entire suite for 24 hours. Please see the report i18n-reliability-report.txt at http://sqesvr/st2/suites/merlin/jdk-bashers/DTF-workspace/hopper-results/1.4.1-beta-b13/ServerVM/64bitsolsparc5.9/mixed/i18n/
###@###.### 2002-05-31
======================================================
Have asked Uday to run the test on DTF test bed again next week (Manday or so) when he completes b13 test run.
###@###.### 2002-06-04
test/unicode/surrogate/ObjectStreamSurrogateTest -> FAIL
---------------------------------- System.err ----------------------------
java.lang.reflect.InvocationTargetException
at sun.reflect.NativeMethodAccessorImpl.invoke0(Native Method)
at sun.reflect.NativeMethodAccessorImpl.invoke(NativeMethodAccessorImpl.java:39)
at sun.reflect.DelegatingMethodAccessorImpl.invoke(DelegatingMethodAccessorImpl.java:25)
at java.lang.reflect.Method.invoke(Method.java:324)
at lib.reliability.I18NBasher.run(I18NBasher.java:401)
at lib.reliability.I18NBasher.<init>(I18NBasher.java:84)
at lib.reliability.I18NBasher.main(I18NBasher.java:29)
Caused by: java.lang.RuntimeException: java.io.StreamCorruptedException: unexpected EOF in middle of data block
at ObjectStreamSurrogateTest.<init>(ObjectStreamSurrogateTest.java:69)
at ObjectStreamSurrogateTest.main(ObjectStreamSurrogateTest.java:75)
... 7 more
JDK : jre1.4.1-b13
Platform[s] : Windows 2000, Linux RedHat 7.2, Sol.9 (64bit)
Note: the same test passed in IA8 and Sol.8
Note: the same test passed in b06 (reliability ran last time)
When run in GlobalSuite, by specifying the specific test, test passed.
When tried with shorter period of time, test passed.
###@###.### 2002-05-30
=============================================================================
The latest GlobalSuite bundle gs13-b07.tar.gz can be found in
/net/sqesvr/export/i18n/i18n_hopper_ws/bundles/v1.3/b07
To run the specific test case after untar, cd to GlobalSuite,
sh run_gs.sh -jdk:[jdk] test/unicode/surrogate/ObjectStreamSurrogateTest.java
(the test case is also attached)
However this way won't reproduce the bug, the bug shows up only after running the entire suite for 24 hours. Please see the report i18n-reliability-report.txt at http://sqesvr/st2/suites/merlin/jdk-bashers/DTF-workspace/hopper-results/1.4.1-beta-b13/ServerVM/64bitsolsparc5.9/mixed/i18n/
###@###.### 2002-05-31
======================================================
Have asked Uday to run the test on DTF test bed again next week (Manday or so) when he completes b13 test run.
###@###.### 2002-06-04