Uploaded image for project: 'JDK'
  1. JDK
  2. JDK-4701664

Reg-test DragTriggerEventTest.html failing

XMLWordPrintable

    • mantis
    • x86
    • windows_nt
    • Verified



      Name: agR10216 Date: 06/13/2002

      ###@###.###
      Failure occurs on WinNT, Linux, Solaris(Intel) with 1.4.1-internal build.

      #Test Results (version 2)
      #Thu Jun 13 11:14:12 MSD 2002
      #checksum:323efa773cce7c37
      #-----testdescription-----
      $file=Y:\\gas\\mantis\\test\\java\\awt\\dnd\\DragTriggerEventTest\\DragTriggerEventTest.html
      $root=Y:\\gas\\mantis\\test
      author=###@###.### area=dnd
      keywords=bug4388802
      run=USER_SPECIFIED applet DragTriggerEventTest.html\r\n
      source=DragTriggerEventTest.html
      title=tests that a drag can be initiated with MOUSE_MOVED event

      #-----environment-----

      #-----testresult-----
      description=file:///Y:/gas/mantis/test/java/awt/dnd/DragTriggerEventTest/DragTriggerEventTest.html
      end=Thu Jun 13 11:14:12 MSD 2002
      environment=regtest
      execStatus=Failed. Execution failed: Applet thread threw exception: java.lang.RuntimeException: The test failed.
      javatestOS=Windows NT 4.0 (x86)
      javatestVersion=2.1.6
      script=com.sun.javatest.regtest.RegressionScript
      sections=script_messages build applet
      start=Thu Jun 13 11:14:00 MSD 2002
      status=Failed. Execution failed: Applet thread threw exception: java.lang.RuntimeException: The test failed.
      test=java/awt/dnd/DragTriggerEventTest/DragTriggerEventTest.html
      work=D:\\work\\tr\\JTwork\\java\\awt\\dnd\\DragTriggerEventTest

      #section:script_messages
      ----------messages:(4/228)----------
      JDK under test: (D:/work/MantisBuild)
      java version "1.4.1-internal"
      Java(TM) 2 Runtime Environment, Standard Edition (build 1.4.1-internal-gas_22_may_2002_16_00)
      Java HotSpot(TM) Client VM (build 1.4.1-beta-b14, mixed mode)

      #section:build
      ----------messages:(3/107)----------
      command: build DragTriggerEventTest
      reason: Named class compiled on demand
      elapsed time (seconds): 0.0
      result: Passed. No need to compile: DragTriggerEventTest.java

      #section:applet
      ----------messages:(3/145)----------
      command: applet DragTriggerEventTest.html
      reason: User specified action: run applet DragTriggerEventTest.html
      elapsed time (seconds): 11.547
      ----------System.out:(0/0)----------
      ----------System.err:(5/328)----------
      java.lang.RuntimeException: The test failed.
              at DragTriggerEventTest.start(DragTriggerEventTest.java:118)
              at com.sun.javatest.regtest.AppletWrapper$AppletThread.run(AppletWrapper.java:145)
              at java.lang.Thread.run(Thread.java:536)
      STATUS:Failed.Applet thread threw exception: java.lang.RuntimeException: The test failed.
      result: Failed. Execution failed: Applet thread threw exception: java.lang.RuntimeException: The test failed.


      test result: Failed. Execution failed: Applet thread threw exception: java.lang.RuntimeException: The test failed.

      ###@###.### 2002-06-13
      ======================================================================

            agerasimsunw Alexander Gerasimov (Inactive)
            agerasimsunw Alexander Gerasimov (Inactive)
            Votes:
            0 Vote for this issue
            Watchers:
            0 Start watching this issue

              Created:
              Updated:
              Resolved:
              Imported:
              Indexed: