Uploaded image for project: 'JDK'
  1. JDK
  2. JDK-4731130

REG-TESTS: java/util/Locale/LocaleDataTest.java and InternationalBAT.java tests

XMLWordPrintable

    • Icon: Bug Bug
    • Resolution: Duplicate
    • Icon: P1 P1
    • None
    • 1.4.1
    • core-libs



      Name: viR10068 Date: 08/13/2002


      Filed By : J2SE-SQA [###@###.###
      JDK : jdk1.4.1-rc-b19
      Testbase : Regression testsuite
      Platform[s] : Solaris sparc
      Falling test[s]: java/util/Locale/LocaleDataTest.java
                       java/util/Locale/InternationalBAT.java

      Note, both this test passed on the jdk1.4.1-rc-b16.

      Test source location:
      =====================
      /java/re/j2se/1.4.1/promoted/rc/b19/ws/j2se/test/java/util/Locale/LocaleDataTest.java
      /java/re/j2se/1.4.1/promoted/rc/b19/ws/j2se/test/java/util/Locale/InternationalBAT.java

      jtr file location:
      ==================
      /net/sqesvr/export/st3/jdk1.4.1/rc/b19/Regression/sparc/s9_cde_64x64_jtg-s121/workDir/test/java/util/Loc
      ale/LocaleDataTest.jtr
      /net/sqesvr/export/st3/jdk1.4.1/rc/b19/Regression/sparc/s9_cde_64x64_jtg-s121/workDir/test/java/util/Loc
      ale/InternationalBAT.jtr

      Test output:
      ============
      LocaleDataTest.java:
      ----------System.out:(7/314)*----------
      Mismatch in LocaleElements/ko/DateTimePatterns/0:
        file = "a hh'\\uc2dc'mm'\\ubd84'ss'\\ucd08' z"
         jvm = "a h'\\uc2dc' m'\\ubd84' s'\\ucd08' z"
      Mismatch in LocaleElements/ko/DateTimePatterns/1:
        file = "a hh'\\uc2dc'mm'\\ubd84'ss'\\ucd08'"
         jvm = "a h'\\uc2dc' m'\\ubd84' s'\\ucd08'"
      Test failed. 2 errors.
      ----------System.err:(13/709)----------
      java.lang.Exception: Test failed. 2 errors.
              at LocaleDataTest.main(LocaleDataTest.java:158)
              at sun.reflect.NativeMethodAccessorImpl.invoke0(Native Method)
              at sun.reflect.NativeMethodAccessorImpl.invoke(NativeMethodAccessorImpl.java:39)
              at sun.reflect.DelegatingMethodAccessorImpl.invoke(DelegatingMethodAccessorImpl.java:25)
              at java.lang.reflect.Method.invoke(Method.java:324)
              at com.sun.javatest.regtest.MainWrapper$MainThread.run(MainWrapper.java:82)
              at java.lang.Thread.run(Thread.java:536)

      JavaTest Message: Test threw exception: java.lang.Exception: Test failed. 2 errors.
      JavaTest Message: shutting down test

      STATUS:Failed.`main' threw exception: java.lang.Exception: Test failed. 2 errors.
      result: Failed. Execution failed: `main' threw exception: java.lang.Exception: Test failed. 2 errors.

      ------------------------------------------------------------------
      InternationalBAT.java:
      ----------System.out:(9/596)----------
      Incorrect date string for locale zh_CN. Expected: 2001?5?10?, got: 2001?5?10? ???
      Incorrect date string for locale zh_TW. Expected: 2001?5?10?, got: 2001?5?10? ???
      Incorrect date string for locale ja_JP. Expected: 2001?5?10?, got: 2001?5?10? (???)

      Some tests failed.
      If you installed the US-only J2RE for Windows, failures are expected and OK.
      If you installed the international J2RE, or any J2SDK, or if this occurs on any platform other than
      Windows, please file a bug report.
      Unfortunately, this test cannot determine whether you installed a US-only J2RE, an international J2RE,
      or a J2SDK.

      ----------System.err:(13/658)----------
      java.lang.RuntimeException
              at InternationalBAT.main(InternationalBAT.java:37)
              at sun.reflect.NativeMethodAccessorImpl.invoke0(Native Method)
              at sun.reflect.NativeMethodAccessorImpl.invoke(NativeMethodAccessorImpl.java:39)
              at sun.reflect.DelegatingMethodAccessorImpl.invoke(DelegatingMethodAccessorImpl.java:25)
              at java.lang.reflect.Method.invoke(Method.java:324)
              at com.sun.javatest.regtest.MainWrapper$MainThread.run(MainWrapper.java:82)
              at java.lang.Thread.run(Thread.java:536)

      JavaTest Message: Test threw exception: java.lang.RuntimeException
      JavaTest Message: shutting down test

      STATUS:Failed.`main' threw exception: java.lang.RuntimeException
      result: Failed. Execution failed: `main' threw exception: java.lang.RuntimeException


      Specific Machine Info:
      ======================
      Hostname: jtg-s121
      SunOS jtg-s121 5.9 Generic sun4u sparc SUNW,Ultra-2

      ======================================================================

            peytoia Yuka Kamiya (Inactive)
            vivsunw Viv Viv (Inactive)
            Votes:
            0 Vote for this issue
            Watchers:
            1 Start watching this issue

              Created:
              Updated:
              Resolved:
              Imported:
              Indexed: