-
Bug
-
Resolution: Cannot Reproduce
-
P2
-
None
-
1.4.2
-
itanium
-
linux_redhat_7.2
--------------------------------------
Test : nsk/regression/b4526821
TestBase : testbase_nsk
VM : server
Mode : comp
Platform : Itanium
OS : RH7.2
----------------------------------------
This test PASSED in sever/-Xmixed mode on ia64
Step to reproduce
1. cd /net/sqesvr.eng/export/vsn/GammaBase/Bugs/{BugID}
2. sh rerun.sh
---------------------------------------------
LOGS:
---------------------------------------------
==> nsk/regression/b4526821 test LOG:
--> This test for #4526821 bug; Category: hotspot; Subcategory: runtime_system
Synopsis: Segmentation Fault: An irrecoverable stack overflow has occurred
--> b4526821: TESTED_JAVA :
/net/sqesvr.sfbay/export/st1/VM/mantis/JDK/latest/linux-ia64/bin/java -server -DHANGINGJAVA2769 -server -Xcomp
--> b4526821: TESTED_JAVA version:
java version "1.4.2-beta"
Java(TM) 2 Runtime Environment, Standard Edition (build 1.4.2-beta-b16)
Java HotSpot(TM) 64-Bit Server VM (build 1.4.2-beta-b16, compiled mode)
--> b4526821: Executing "TESTED_JAVA b4526821" command...
--> command exit status = 0
--> b4526821: part of OutPut produced by executed command:
----------------------------- part of OutPut BEGIN:
**> b4526821 java test started:
...
DEPTH=173719
DEPTH=173720
DEPTH=173721
Unexpected Signal : 11 occurred at PC=0x20000000008FF220
Function=load_classfile__11ClassLoaderG12symbolHandleP6Thread+0x500
Library=/.automount/vmsqe.sfbay/root/export/weekly/mantis/JDK/b16/linux-ia64/jre/lib/ia64/server/libjvm.so
Current Java thread:
at java.nio.charset.CharsetEncoder.encode(CharsetEncoder.java:536)
at sun.nio.cs.StreamEncoder$CharsetSE.implWrite(StreamEncoder.java:384)
at sun.nio.cs.StreamEncoder.write(StreamEncoder.java:136)
****************
Another exception has been detected while we were handling last error.
Dumping information about last error:
ERROR REPORT FILE = (N/A)
PC = 0x20000000008ff220
SIGNAL = 11
FUNCTION NAME = load_classfile__11ClassLoaderG12symbolHandleP6Thread
OFFSET = 0x500
LIBRARY NAME = /.automount/vmsqe.sfbay/root/export/weekly/mantis/JDK/b16/linux-ia64/jre/lib/ia64/server/libjvm.so
Please check ERROR REPORT FILE for further information, if there is any.
Good bye.
----------------------------- OutPut END
##> FAILURE: Unexpected Exit Status of b4526821 java test execution with TESTED_JAVA!
## expected Exit Status = 95
==> nsk/regression/b4526821 TEST FAILED
Test : nsk/regression/b4526821
TestBase : testbase_nsk
VM : server
Mode : comp
Platform : Itanium
OS : RH7.2
----------------------------------------
This test PASSED in sever/-Xmixed mode on ia64
Step to reproduce
1. cd /net/sqesvr.eng/export/vsn/GammaBase/Bugs/{BugID}
2. sh rerun.sh
---------------------------------------------
LOGS:
---------------------------------------------
==> nsk/regression/b4526821 test LOG:
--> This test for #4526821 bug; Category: hotspot; Subcategory: runtime_system
Synopsis: Segmentation Fault: An irrecoverable stack overflow has occurred
--> b4526821: TESTED_JAVA :
/net/sqesvr.sfbay/export/st1/VM/mantis/JDK/latest/linux-ia64/bin/java -server -DHANGINGJAVA2769 -server -Xcomp
--> b4526821: TESTED_JAVA version:
java version "1.4.2-beta"
Java(TM) 2 Runtime Environment, Standard Edition (build 1.4.2-beta-b16)
Java HotSpot(TM) 64-Bit Server VM (build 1.4.2-beta-b16, compiled mode)
--> b4526821: Executing "TESTED_JAVA b4526821" command...
--> command exit status = 0
--> b4526821: part of OutPut produced by executed command:
----------------------------- part of OutPut BEGIN:
**> b4526821 java test started:
...
DEPTH=173719
DEPTH=173720
DEPTH=173721
Unexpected Signal : 11 occurred at PC=0x20000000008FF220
Function=load_classfile__11ClassLoaderG12symbolHandleP6Thread+0x500
Library=/.automount/vmsqe.sfbay/root/export/weekly/mantis/JDK/b16/linux-ia64/jre/lib/ia64/server/libjvm.so
Current Java thread:
at java.nio.charset.CharsetEncoder.encode(CharsetEncoder.java:536)
at sun.nio.cs.StreamEncoder$CharsetSE.implWrite(StreamEncoder.java:384)
at sun.nio.cs.StreamEncoder.write(StreamEncoder.java:136)
****************
Another exception has been detected while we were handling last error.
Dumping information about last error:
ERROR REPORT FILE = (N/A)
PC = 0x20000000008ff220
SIGNAL = 11
FUNCTION NAME = load_classfile__11ClassLoaderG12symbolHandleP6Thread
OFFSET = 0x500
LIBRARY NAME = /.automount/vmsqe.sfbay/root/export/weekly/mantis/JDK/b16/linux-ia64/jre/lib/ia64/server/libjvm.so
Please check ERROR REPORT FILE for further information, if there is any.
Good bye.
----------------------------- OutPut END
##> FAILURE: Unexpected Exit Status of b4526821 java test execution with TESTED_JAVA!
## expected Exit Status = 95
==> nsk/regression/b4526821 TEST FAILED