-
Bug
-
Resolution: Cannot Reproduce
-
P4
-
None
-
6
-
x86
-
windows_nt
This test fails in the nighly Tiger builds (build 2) on windows.
#Test Results (version 2)
#Sun Mar 16 03:13:29 PST 2003
#checksum:5894f3a7f7e153c9
#-----testdescription-----
$file=K:\\ws\\AWT.link\\AWT-Tiger\\test\\java\\awt\\Component\\ZeroSizePaintingTest\\ZeroSizePainting.html
$root=K:\\ws\\AWT.link\\AWT-Tiger\\test
author=###@###.### area=
keywords=bug4262108
run=USER_SPECIFIED applet ZeroSizePainting.html\r\n
source=ZeroSizePainting.html
title=tests that zero sized components aren't painted.
#-----environment-----
#-----testresult-----
description=file:///K:/ws/AWT.link/AWT-Tiger/test/java/awt/Component/ZeroSizePaintingTest/ZeroSizePainting.html
end=Sun Mar 16 03:13:29 PST 2003
environment=regtest
execStatus=Failed. Execution failed: Applet thread threw exception: java.lang.RuntimeException: Test FAILED
javatestOS=Windows 2000 5.0 (x86)
javatestVersion=2.1.6
script=com.sun.javatest.regtest.RegressionScript
sections=script_messages build compile applet
start=Sun Mar 16 03:12:50 PST 2003
status=Failed. Execution failed: Applet thread threw exception: java.lang.RuntimeException: Test FAILED
test=java/awt/Component/ZeroSizePaintingTest/ZeroSizePainting.html
work=W:\\bchristi\\NightlyBuilds\\archive-TIGER\\2003-03-16-Sun-TIGER\\windows-i586\\test\\jtreg\\JTwork\\java\\awt\\Component\\ZeroSizePaintingTest
#section:script_messages
----------messages:(4/247)----------
JDK under test: (c:/nightlyTIGER/build/windows-i586)
java version "Build:16-Mar-03@00:57.TIGER"
Java(TM) 2 Runtime Environment, Standard Edition (build Build:16-Mar-03@00:57.TIGER)
Java HotSpot(TM) Client VM (build 1.4.2-beta-b18, mixed mode)
#section:build
----------messages:(3/105)----------
command: build ZeroSizePainting
reason: Named class compiled on demand
elapsed time (seconds): 5.788
result: Passed. Compilation successful
#section:compile
----------messages:(3/202)*----------
command: compile K:\\ws\\AWT.link\\AWT-Tiger\\test\\java\\awt\\Component\\ZeroSizePaintingTest\\ZeroSizePainting.java
reason: .class file out of date or does not exist
elapsed time (seconds): 5.778
----------System.out:(0/0)----------
----------System.err:(2/192)*----------
Note: K:\\ws\\AWT.link\\AWT-Tiger\\test\\java\\awt\\Component\\ZeroSizePaintingTest\\ZeroSizePainting.java uses or overrides a deprecated API.
Note: Recompile with -deprecation for details.
result: Passed. Compilation successful
#section:applet
----------messages:(3/137)----------
command: applet ZeroSizePainting.html
reason: User specified action: run applet ZeroSizePainting.html
elapsed time (seconds): 33.338
----------System.out:(0/0)----------
----------System.err:(5/309)----------
java.lang.RuntimeException: Test FAILED
at ZeroSizePainting.start(ZeroSizePainting.java:72)
at com.sun.javatest.regtest.AppletWrapper$AppletThread.run(AppletWrapper.java:145)
at java.lang.Thread.run(Thread.java:534)
STATUS:Failed.Applet thread threw exception: java.lang.RuntimeException: Test FAILED
result: Failed. Execution failed: Applet thread threw exception: java.lang.RuntimeException: Test FAILED
test result: Failed. Execution failed: Applet thread threw exception: java.lang.RuntimeException: Test FAILED
#Test Results (version 2)
#Sun Mar 16 03:13:29 PST 2003
#checksum:5894f3a7f7e153c9
#-----testdescription-----
$file=K:\\ws\\AWT.link\\AWT-Tiger\\test\\java\\awt\\Component\\ZeroSizePaintingTest\\ZeroSizePainting.html
$root=K:\\ws\\AWT.link\\AWT-Tiger\\test
author=###@###.### area=
keywords=bug4262108
run=USER_SPECIFIED applet ZeroSizePainting.html\r\n
source=ZeroSizePainting.html
title=tests that zero sized components aren't painted.
#-----environment-----
#-----testresult-----
description=file:///K:/ws/AWT.link/AWT-Tiger/test/java/awt/Component/ZeroSizePaintingTest/ZeroSizePainting.html
end=Sun Mar 16 03:13:29 PST 2003
environment=regtest
execStatus=Failed. Execution failed: Applet thread threw exception: java.lang.RuntimeException: Test FAILED
javatestOS=Windows 2000 5.0 (x86)
javatestVersion=2.1.6
script=com.sun.javatest.regtest.RegressionScript
sections=script_messages build compile applet
start=Sun Mar 16 03:12:50 PST 2003
status=Failed. Execution failed: Applet thread threw exception: java.lang.RuntimeException: Test FAILED
test=java/awt/Component/ZeroSizePaintingTest/ZeroSizePainting.html
work=W:\\bchristi\\NightlyBuilds\\archive-TIGER\\2003-03-16-Sun-TIGER\\windows-i586\\test\\jtreg\\JTwork\\java\\awt\\Component\\ZeroSizePaintingTest
#section:script_messages
----------messages:(4/247)----------
JDK under test: (c:/nightlyTIGER/build/windows-i586)
java version "Build:16-Mar-03@00:57.TIGER"
Java(TM) 2 Runtime Environment, Standard Edition (build Build:16-Mar-03@00:57.TIGER)
Java HotSpot(TM) Client VM (build 1.4.2-beta-b18, mixed mode)
#section:build
----------messages:(3/105)----------
command: build ZeroSizePainting
reason: Named class compiled on demand
elapsed time (seconds): 5.788
result: Passed. Compilation successful
#section:compile
----------messages:(3/202)*----------
command: compile K:\\ws\\AWT.link\\AWT-Tiger\\test\\java\\awt\\Component\\ZeroSizePaintingTest\\ZeroSizePainting.java
reason: .class file out of date or does not exist
elapsed time (seconds): 5.778
----------System.out:(0/0)----------
----------System.err:(2/192)*----------
Note: K:\\ws\\AWT.link\\AWT-Tiger\\test\\java\\awt\\Component\\ZeroSizePaintingTest\\ZeroSizePainting.java uses or overrides a deprecated API.
Note: Recompile with -deprecation for details.
result: Passed. Compilation successful
#section:applet
----------messages:(3/137)----------
command: applet ZeroSizePainting.html
reason: User specified action: run applet ZeroSizePainting.html
elapsed time (seconds): 33.338
----------System.out:(0/0)----------
----------System.err:(5/309)----------
java.lang.RuntimeException: Test FAILED
at ZeroSizePainting.start(ZeroSizePainting.java:72)
at com.sun.javatest.regtest.AppletWrapper$AppletThread.run(AppletWrapper.java:145)
at java.lang.Thread.run(Thread.java:534)
STATUS:Failed.Applet thread threw exception: java.lang.RuntimeException: Test FAILED
result: Failed. Execution failed: Applet thread threw exception: java.lang.RuntimeException: Test FAILED
test result: Failed. Execution failed: Applet thread threw exception: java.lang.RuntimeException: Test FAILED