-
Bug
-
Resolution: Fixed
-
P1
-
1.3.1_08
-
None
-
08
-
generic
-
generic
-
Verified
Date of nightly build failure : 1/29/2003
Hotspot builds on 1.3.1_08 Sparc, x86 and Linux have failed
Only Win32 build passed. I have attached an excerpt from the build log.
Compiling
/net/nightsvr/export3/nightly/1.3.1/src/hotspot/src/share/vm/ci/ciSymb
ol.cpp
"/net/nightsvr/export3/nightly/1.3.1/src/hotspot/src/share/vm/ci/ciObjectFactory
.cpp", line 95: Error: vmSymbols is not defined.
"/net/nightsvr/export3/nightly/1.3.1/src/hotspot/src/share/vm/ci/ciObjectFactory
.cpp", line 95: Error: The function "dummy_symbol_oop" must have a
prototype.
2 Error(s) detected.
gnumake[2]: *** [ciObjectFactory.o] Error 2
gnumake[2]: *** Waiting for unfinished jobs....
gnumake[2]: Leaving directory
`/net/nightsvr/export3/nightly/1.3.1/src/hotspot/b
uild/solaris/solaris_sparc_compiler1/product'
gnumake[1]: *** [the_vm] Error 2
gnumake[1]: Leaving directory
`/net/nightsvr/export3/nightly/1.3.1/src/hotspot/b
uild/solaris/solaris_sparc_compiler1/product'
gnumake: *** [product1] Error
2
For the complete build log, please check :-
/net/nightsvr/export3/nightly/1.3.1/logs/sparc