Uploaded image for project: 'JDK'
  1. JDK
  2. JDK-4861866

1.2.2_16 builds (05/08/03) fail on Sparc and x86 after putback of 4811913

XMLWordPrintable

    • 016
    • generic
    • generic
    • Verified


        Date of nightly build failure : 05/08/03
        ========================================

        For complete log, please see
         /net/nightsvr.sfbay/export3/nightly/1.2.2_prod/logs/sparc/latest_image.log
         /net/nightsvr.sfbay/export3/nightly/1.2.2_prod/logs/i386/latest_image.log

        tail of log is given here.

        if [ -s .classes.list ] ; then /net/nightsvr.SFbay/export3/nightly/tools/1.2.2_prod/sparc/jdk-boot/usr/java1.2/bin/javac -J-Xms16m -J-Xmx128m -J-Djava.compiler=sunwjit -bootclasspath ../../classes -sourcepath ../../../../src/solaris/classes:../../../../src/share/classes -d ../../classes ../../../../src/share/classes/java/io/BufferedWriter.java ../../../../src/share/classes/java/io/FileInputStream.java ../../../../src/share/classes/java/io/OutputStream.java ../../../../src/share/classes/java/io/OutputStreamWriter.java ../../../../src/share/classes/java/io/PrintStream.java ../../../../src/share/classes/java/lang/Class.java ../../../../src/share/classes/java/lang/Exception.java ../../../../src/share/classes/java/lang/SecurityManager.java ../../../../src/share/classes/java/lang/String.java ../../../../src/share/classes/java/lang/Thread.java ../../../../src/share/classes/java/lang/ThreadGroup.java ../../../../src/share/classes/java/lang/Throwable.java ../../../../src/share/classes/java/util/Hashtable.java ../../../../src/share/classes/sun/io/ByteToCharConverter.java ../../../../src/share/classes/sun/io/CharToByteConverter.java ../../../../src/solaris/classes/sun/exactvm/MemoryArea.java ; fi
        ../../../../src/share/classes/java/util/zip/ZipInputStream.java:129: 'return' without value from int read(byte[], int, int).
                    return;
                    ^
        1 error
        gnumake[3]: *** [.compile.classlist] Error 1
        gnumake[3]: Leaving directory `/net/nightsvr/export3/nightly/1.2.2_prod/src/sparc/build/solaris/java/sunwjit'
        gnumake[2]: *** [optimized] Error 2
        gnumake[2]: Leaving directory `/net/nightsvr/export3/nightly/1.2.2_prod/src/sparc/build/solaris/java/sunwjit'
        gnumake[1]: *** [all] Error 1
        gnumake[1]: Leaving directory `/net/nightsvr/export3/nightly/1.2.2_prod/src/sparc/build/solaris/java'
        gnumake: *** [all] Error 1

        real 2:43.2
        user 50.2
        sys 4.4
        Error: build of javavm binaries failed.
        ****** End 'build_javavm_cte -DW' Clobber and Compile build ******

              poonam Poonam Bajaj Parhar
              lwudali Lalini Wudali (Inactive)
              Votes:
              0 Vote for this issue
              Watchers:
              0 Start watching this issue

                Created:
                Updated:
                Resolved:
                Imported:
                Indexed: