Uploaded image for project: 'JDK'
  1. JDK
  2. JDK-4912021

com/sun/jdi/MethodEntryExitEvents test failed

XMLWordPrintable

    • Icon: Bug Bug
    • Resolution: Cannot Reproduce
    • Icon: P3 P3
    • None
    • 5.0
    • core-svc
    • itanium
    • windows_2003

      com/sun/jdi/MethodEntryExitEvents test failed on windows-ia64 platform.
      Here is error message. Please see attached htr file for log,

      ----------System.err:(28/1712)----------
      java.lang.RuntimeException: VM Disconnected before requested event occurred
              at TestScaffold.waitForRequestedEvent(TestScaffold.java:670)
              at TestScaffold.resumeTo(TestScaffold.java:714)
              at TestScaffold.resumeTo(TestScaffold.java:766)
              at MethodEntryExitEvents.runTests(MethodEntryExitEvents.java:228)
              at TestScaffold.startTests(TestScaffold.java:396)
              at MethodEntryExitEvents.main(MethodEntryExitEvents.java:112)
              at sun.reflect.NativeMethodAccessorImpl.invoke0(Native Method)
              at sun.reflect.NativeMethodAccessorImpl.invoke(NativeMethodAccessorImpl.java:39)
              at sun.reflect.DelegatingMethodAccessorImpl.invoke(DelegatingMethodAccessorImpl.java:25)
              at java.lang.reflect.Method.invoke(Method.java:324)
              at com.sun.javatest.regtest.MainWrapper$MainThread.run(MainWrapper.java:94)
              at java.lang.Thread.run(Thread.java:549)
      java.lang.Exception: MethodEntryExitEvents: failed
              at MethodEntryExitEvents.runTests(MethodEntryExitEvents.java:283)
              at TestScaffold.startTests(TestScaffold.java:396)
              at MethodEntryExitEvents.main(MethodEntryExitEvents.java:112)
              at sun.reflect.NativeMethodAccessorImpl.invoke0(Native Method)
              at sun.reflect.NativeMethodAccessorImpl.invoke(NativeMethodAccessorImpl.java:39)
              at sun.reflect.DelegatingMethodAccessorImpl.invoke(DelegatingMethodAccessorImpl.java:25)
              at java.lang.reflect.Method.invoke(Method.java:324)
              at com.sun.javatest.regtest.MainWrapper$MainThread.run(MainWrapper.java:94)
              at java.lang.Thread.run(Thread.java:549)

      JavaTest Message: Test threw exception: java.lang.Exception: MethodEntryExitEvents: failed
      JavaTest Message: shutting down test

      STATUS:Failed.`main' threw exception: java.lang.Exception: MethodEntryExitEvents: failed
      result: Failed. Execution failed: `main' threw exception: java.lang.Exception: MethodEntryExitEvents: failed

            dcubed Daniel Daugherty
            fhsusunw Francis Hsu (Inactive)
            Votes:
            0 Vote for this issue
            Watchers:
            0 Start watching this issue

              Created:
              Updated:
              Resolved:
              Imported:
              Indexed: