-
Bug
-
Resolution: Fixed
-
P4
-
6
-
b51
-
x86
-
linux, linux_redhat_2.1
JAVA VERSION :
----------------
java version "awt.pit-jcg-linux-02-2004-04-01-Thu.tiger"
Java(TM) 2 Runtime Environment, Standard Edition (build awt.pit-jcg-linux-02-2004-04-01-Thu.tiger)
Java HotSpot(TM) Client VM (build 1.5.0-beta2-b45, mixed mode)
PLATFORM :
----------
RedHat Advance Server 2.1
javatestOS=Linux 2.4.9-e.24 (i386)
javatestVersion=2.1.5
Failed Test :
-------------
java/awt/Focus/ComponentLostFocusTest/ComponentLostFocusTest.html
Test Location :
---------------
jano.sfbay.sun.com:/java/jdk/ws/AWT/AWT-Tiger/test/java/awt/Focus/ComponentLostFocusTest
JTR Location :
---------------
Find attached with this bug.
Steps to reproduce :-
---------------------
1. set JTREG_HOME to the jtreg home directory.
2. set JAVA_HOME to the PIT build 01-Apr-2004.
3. Executing the command "jtreg -va -cpa:<classpath> ComponentLostFocusTest.html" throws
java.lang.RuntimeException: Frame got no focus! Test failed.
at ComponentLostFocusTest.start(ComponentLostFocusTest.java:56)
at com.sun.javatest.regtest.AppletWrapper$AppletThread.run(AppletWrapper.java:145)
at java.lang.Thread.run(Thread.java:570)
STATUS:Failed.Applet thread threw exception: java.lang.RuntimeException: Frame got no focus! Test failed.
result: Failed. Execution failed: Applet thread threw exception: java.lang.RuntimeException: Frame got no focus! Test failed.
----------------
java version "awt.pit-jcg-linux-02-2004-04-01-Thu.tiger"
Java(TM) 2 Runtime Environment, Standard Edition (build awt.pit-jcg-linux-02-2004-04-01-Thu.tiger)
Java HotSpot(TM) Client VM (build 1.5.0-beta2-b45, mixed mode)
PLATFORM :
----------
RedHat Advance Server 2.1
javatestOS=Linux 2.4.9-e.24 (i386)
javatestVersion=2.1.5
Failed Test :
-------------
java/awt/Focus/ComponentLostFocusTest/ComponentLostFocusTest.html
Test Location :
---------------
jano.sfbay.sun.com:/java/jdk/ws/AWT/AWT-Tiger/test/java/awt/Focus/ComponentLostFocusTest
JTR Location :
---------------
Find attached with this bug.
Steps to reproduce :-
---------------------
1. set JTREG_HOME to the jtreg home directory.
2. set JAVA_HOME to the PIT build 01-Apr-2004.
3. Executing the command "jtreg -va -cpa:<classpath> ComponentLostFocusTest.html" throws
java.lang.RuntimeException: Frame got no focus! Test failed.
at ComponentLostFocusTest.start(ComponentLostFocusTest.java:56)
at com.sun.javatest.regtest.AppletWrapper$AppletThread.run(AppletWrapper.java:145)
at java.lang.Thread.run(Thread.java:570)
STATUS:Failed.Applet thread threw exception: java.lang.RuntimeException: Frame got no focus! Test failed.
result: Failed. Execution failed: Applet thread threw exception: java.lang.RuntimeException: Frame got no focus! Test failed.
- duplicates
-
JDK-5062390 Regression-test java/awt/Focus/ComponentLostFocusTest/ComponentLostFocusTest.htm
-
- Closed
-
- relates to
-
JDK-4982943 focus lost in text fields or text areas, unable to enter characters from keyboar
-
- Resolved
-
-
JDK-5018603 TEST_BUG: Regression-test java/awt/Focus/ComponentLostFocusTest/ComponentLostF
-
- Closed
-