-
Bug
-
Resolution: Duplicate
-
P3
-
None
-
5.0
-
generic
-
generic
========================================================================
Tested JDK : /net/jano.sfbay/export/disk12/i18n/NightlyBuilds/archives/2004-04-08.tiger
Tested OS: RH AS 3.0, Sol. 10, Sol 9.0
Test workspace: /net/jano.sfbay/export/disk12/i18n/ws/jdk1.5/j2se/test
=======================================================================
regression test sun/text/resources/Locale/Bug4640234.java failed with the following exceptions:
----------System.out:(603/39654)----------
Test failed!
ERROR: German country name for country code: AX not found!
ERROR: Spanish country name for country code: AX not found!
ERROR: French country name for country code: AX not found!
ERROR: Italian country name for country code: AX not found!
ERROR: Japanese country name for country code: AX not found!
ERROR: Korean country name for country code: AX not found!
ERROR: Swedish country name for country code: AX not found!
ERROR: Chinese (China) country name for country code: AX not found!
ERROR: Chinese (Taiwan) country name for country code: AX not found!
WARNING: German country name for country code: AD not localized!
.....
.....
.....
WARNING: Swedish language name for language code: ve not localized!
----------System.err:(15/763)----------
java.lang.Exception:
Test failed! ERROR: some keys are missing!
at Bug4640234.main(Bug4640234.java:126)
at sun.reflect.NativeMethodAccessorImpl.invoke0(Native Method)
at sun.reflect.NativeMethodAccessorImpl.invoke(NativeMethodAccessorImpl.java:39)
at sun.reflect.DelegatingMethodAccessorImpl.invoke(DelegatingMethodAccessorImpl.java:25)
at java.lang.reflect.Method.invoke(Method.java:495)
at com.sun.javatest.regtest.MainWrapper$MainThread.run(MainWrapper.java:94)
at java.lang.Thread.run(Thread.java:570)
JavaTest Message: Test threw exception: java.lang.Exception:
Test failed! ERROR: some keys are missing!
JavaTest Message: shutting down test
STATUS:Failed.`main' threw exception: java.lang.Exception: Test failed! ERROR: some keys are missing!
result: Failed. Execution failed: `main' threw exception: java.lang.Exception: Test failed! ERROR: some keys are missing!
The detailed exception can be found at
http://sqeweb.sfbay/i18n/projects/tiger/PIT/04.08.04/sol10-ar-reg/failed.html
The same test failed in previous promoted builds as well.
Tested JDK : /net/jano.sfbay/export/disk12/i18n/NightlyBuilds/archives/2004-04-08.tiger
Tested OS: RH AS 3.0, Sol. 10, Sol 9.0
Test workspace: /net/jano.sfbay/export/disk12/i18n/ws/jdk1.5/j2se/test
=======================================================================
regression test sun/text/resources/Locale/Bug4640234.java failed with the following exceptions:
----------System.out:(603/39654)----------
Test failed!
ERROR: German country name for country code: AX not found!
ERROR: Spanish country name for country code: AX not found!
ERROR: French country name for country code: AX not found!
ERROR: Italian country name for country code: AX not found!
ERROR: Japanese country name for country code: AX not found!
ERROR: Korean country name for country code: AX not found!
ERROR: Swedish country name for country code: AX not found!
ERROR: Chinese (China) country name for country code: AX not found!
ERROR: Chinese (Taiwan) country name for country code: AX not found!
WARNING: German country name for country code: AD not localized!
.....
.....
.....
WARNING: Swedish language name for language code: ve not localized!
----------System.err:(15/763)----------
java.lang.Exception:
Test failed! ERROR: some keys are missing!
at Bug4640234.main(Bug4640234.java:126)
at sun.reflect.NativeMethodAccessorImpl.invoke0(Native Method)
at sun.reflect.NativeMethodAccessorImpl.invoke(NativeMethodAccessorImpl.java:39)
at sun.reflect.DelegatingMethodAccessorImpl.invoke(DelegatingMethodAccessorImpl.java:25)
at java.lang.reflect.Method.invoke(Method.java:495)
at com.sun.javatest.regtest.MainWrapper$MainThread.run(MainWrapper.java:94)
at java.lang.Thread.run(Thread.java:570)
JavaTest Message: Test threw exception: java.lang.Exception:
Test failed! ERROR: some keys are missing!
JavaTest Message: shutting down test
STATUS:Failed.`main' threw exception: java.lang.Exception: Test failed! ERROR: some keys are missing!
result: Failed. Execution failed: `main' threw exception: java.lang.Exception: Test failed! ERROR: some keys are missing!
The detailed exception can be found at
http://sqeweb.sfbay/i18n/projects/tiger/PIT/04.08.04/sol10-ar-reg/failed.html
The same test failed in previous promoted builds as well.
- duplicates
-
JDK-5023181 l10n for 5008299: A country name "\u00c5LAND ISLANDS" needs to be added
-
- Resolved
-