-
Bug
-
Resolution: Fixed
-
P3
-
5.0
-
b50
-
sparc
-
solaris_10
DISPLAY : mojava.sfbay.sun.com:0.0
PLATFORM : solaris
HOST : lunarorbit
DATE : 04-04-28-10-39
java version "1.5.0-internal"
Java(TM) 2 Runtime Environment, Standard Edition (build 1.5.0-internal-mr_27_apr_2004_18_05)
Java HotSpot(TM) Client VM (build 1.5.0-beta2-b48, mixed mode, sharing)
=============================================================================
--- Regression Test Result ---
/net/phys-sqesvr-1/j2se-sqe/scratch/sec/test_exec/Tiger_Nightly/Regression/results/04-04-28-10-39.solaris.lunarorbit
=============================================================================
com/sun/net/ssl/internal/ssl/Handshaker/TrustManagerArrayModification.java Failed. Execution failed: `main' threw exception: javax.net.ssl.SSLException: Received fatal alert: internal_error
sanity/jar/CheckJAR.java Failed. Execution failed: `main' threw exception: java.lang.Exception: File size unexpected: 262332 < 523609 < 273039
sun/net/www/protocol/https/HttpsURLConnection/CookieHandlerTest.java Failed. Compilation failed
###@###.### 2004-04-29
PLATFORM : solaris
HOST : lunarorbit
DATE : 04-04-28-10-39
java version "1.5.0-internal"
Java(TM) 2 Runtime Environment, Standard Edition (build 1.5.0-internal-mr_27_apr_2004_18_05)
Java HotSpot(TM) Client VM (build 1.5.0-beta2-b48, mixed mode, sharing)
=============================================================================
--- Regression Test Result ---
/net/phys-sqesvr-1/j2se-sqe/scratch/sec/test_exec/Tiger_Nightly/Regression/results/04-04-28-10-39.solaris.lunarorbit
=============================================================================
com/sun/net/ssl/internal/ssl/Handshaker/TrustManagerArrayModification.java Failed. Execution failed: `main' threw exception: javax.net.ssl.SSLException: Received fatal alert: internal_error
sanity/jar/CheckJAR.java Failed. Execution failed: `main' threw exception: java.lang.Exception: File size unexpected: 262332 < 523609 < 273039
sun/net/www/protocol/https/HttpsURLConnection/CookieHandlerTest.java Failed. Compilation failed
###@###.### 2004-04-29
- relates to
-
JDK-5039412 ResponseCache and CookieHandler reg tests need to be updated for generified APIs
-
- Resolved
-