-
Bug
-
Resolution: Cannot Reproduce
-
P3
-
6
-
generic
-
solaris_9
System Config.:
Mustang B27, on Solaris sparc 10 (koi), Solaris sparc 9 (miragelv, sebring), Solaris sparc 8 (treasure)
Symptom:
The following 3 test cases failed on Mustang b24, b25, b26, b27 & b28.
They passed on Mustang b23, b22.
The tests are:
--------------
AWT_DnD/XDnD/Automated/Motif_DnD/JavaToNative/LeaveNotificationTest execute_script
AWT_DnD/XDnD/Automated/Motif_DnD/JavaToNative/DragDropEndTest execute_script
AWT_DnD/XDnD/Automated/Motif_DnD/NativeToJava/DragEnterTest execute_script
Test result location:
---------------------
princess2% pwd
/net/cady/export4/results/mustang/b27/awt/6.0-awt-sparc9_c2-2005-03-11-17-57-26-0988/rerun_jetfly/dtftest.SunOS.sparc/DragDropEndTest
princess2% cat DragDropEndTest.err
"motif-child.c", line 19: warning: macro redefined: TRACE
TEST FAIL: Drop data is null
TEST FAIL: Drop is NOT successful
TEST FAIL: drop event did not occur at the target native app
TEST FAIL: dragDropEnd event did not occur at the target native app
TEST FAILED due to above reason
java.io.IOException: Owner failed to convert data
at sun.awt.X11.XSelection.getData(XSelection.java:316)
at sun.awt.X11.MotifDnDDropTargetProtocol.getData(MotifDnDDropTargetProtocol.java:860)
at sun.awt.X11.XDropTargetContextPeer.getNativeData(XDropTargetContextPeer.java:127)
at sun.awt.dnd.SunDropTargetContextPeer.getTransferData(SunDropTargetContextPeer.java:228)
at sun.awt.datatransfer.TransferableProxy.getTransferData(TransferableProxy.java:56)
at java.awt.dnd.DropTargetContext$TransferableProxy.getTransferData(DropTargetContext.java:359)
at DragDropEndTest$2$4.drop(DragDropEndTest.java:250)
at java.awt.dnd.DropTarget.drop(DropTarget.java:430)
at sun.awt.dnd.SunDropTargetContextPeer.processDropMessage(SunDropTargetContextPeer.java:500)
at sun.awt.dnd.SunDropTargetContextPeer.access$800(SunDropTargetContextPeer.java:53)
at sun.awt.dnd.SunDropTargetContextPeer$EventDispatcher.dispatchDropEvent(SunDropTargetContextPeer.java:812)
at sun.awt.dnd.SunDropTargetContextPeer$EventDispatcher.dispatchEvent(SunDropTargetContextPeer.java:736)
at sun.awt.dnd.SunDropTargetEvent.dispatch(SunDropTargetEvent.java:30)
at java.awt.Component.dispatchEventImpl(Component.java:3896)
at java.awt.Container.dispatchEventImpl(Container.java:2023)
at java.awt.Window.dispatchEventImpl(Window.java:1808)
at java.awt.Component.dispatchEvent(Component.java:3873)
at java.awt.EventQueue.dispatchEvent(EventQueue.java:591)
at java.awt.EventDispatchThread.pumpOneEventForHierarchy(EventDispatchThread.java:247)
at java.awt.EventDispatchThread.pumpEventsForHierarchy(EventDispatchThread.java:168)
at java.awt.EventDispatchThread.pumpEvents(EventDispatchThread.java:162)
at java.awt.EventDispatchThread.pumpEvents(EventDispatchThread.java:154)
at java.awt.EventDispatchThread.run(EventDispatchThread.java:115)
Please see attached test result file (XDnD.tar) in case you
can not access to the result directory on /net/cady.
###@###.### 2005-03-19 01:40:06 GMT
Mustang B27, on Solaris sparc 10 (koi), Solaris sparc 9 (miragelv, sebring), Solaris sparc 8 (treasure)
Symptom:
The following 3 test cases failed on Mustang b24, b25, b26, b27 & b28.
They passed on Mustang b23, b22.
The tests are:
--------------
AWT_DnD/XDnD/Automated/Motif_DnD/JavaToNative/LeaveNotificationTest execute_script
AWT_DnD/XDnD/Automated/Motif_DnD/JavaToNative/DragDropEndTest execute_script
AWT_DnD/XDnD/Automated/Motif_DnD/NativeToJava/DragEnterTest execute_script
Test result location:
---------------------
princess2% pwd
/net/cady/export4/results/mustang/b27/awt/6.0-awt-sparc9_c2-2005-03-11-17-57-26-0988/rerun_jetfly/dtftest.SunOS.sparc/DragDropEndTest
princess2% cat DragDropEndTest.err
"motif-child.c", line 19: warning: macro redefined: TRACE
TEST FAIL: Drop data is null
TEST FAIL: Drop is NOT successful
TEST FAIL: drop event did not occur at the target native app
TEST FAIL: dragDropEnd event did not occur at the target native app
TEST FAILED due to above reason
java.io.IOException: Owner failed to convert data
at sun.awt.X11.XSelection.getData(XSelection.java:316)
at sun.awt.X11.MotifDnDDropTargetProtocol.getData(MotifDnDDropTargetProtocol.java:860)
at sun.awt.X11.XDropTargetContextPeer.getNativeData(XDropTargetContextPeer.java:127)
at sun.awt.dnd.SunDropTargetContextPeer.getTransferData(SunDropTargetContextPeer.java:228)
at sun.awt.datatransfer.TransferableProxy.getTransferData(TransferableProxy.java:56)
at java.awt.dnd.DropTargetContext$TransferableProxy.getTransferData(DropTargetContext.java:359)
at DragDropEndTest$2$4.drop(DragDropEndTest.java:250)
at java.awt.dnd.DropTarget.drop(DropTarget.java:430)
at sun.awt.dnd.SunDropTargetContextPeer.processDropMessage(SunDropTargetContextPeer.java:500)
at sun.awt.dnd.SunDropTargetContextPeer.access$800(SunDropTargetContextPeer.java:53)
at sun.awt.dnd.SunDropTargetContextPeer$EventDispatcher.dispatchDropEvent(SunDropTargetContextPeer.java:812)
at sun.awt.dnd.SunDropTargetContextPeer$EventDispatcher.dispatchEvent(SunDropTargetContextPeer.java:736)
at sun.awt.dnd.SunDropTargetEvent.dispatch(SunDropTargetEvent.java:30)
at java.awt.Component.dispatchEventImpl(Component.java:3896)
at java.awt.Container.dispatchEventImpl(Container.java:2023)
at java.awt.Window.dispatchEventImpl(Window.java:1808)
at java.awt.Component.dispatchEvent(Component.java:3873)
at java.awt.EventQueue.dispatchEvent(EventQueue.java:591)
at java.awt.EventDispatchThread.pumpOneEventForHierarchy(EventDispatchThread.java:247)
at java.awt.EventDispatchThread.pumpEventsForHierarchy(EventDispatchThread.java:168)
at java.awt.EventDispatchThread.pumpEvents(EventDispatchThread.java:162)
at java.awt.EventDispatchThread.pumpEvents(EventDispatchThread.java:154)
at java.awt.EventDispatchThread.run(EventDispatchThread.java:115)
Please see attached test result file (XDnD.tar) in case you
can not access to the result directory on /net/cady.
###@###.### 2005-03-19 01:40:06 GMT
- relates to
-
JDK-6240608 XToolkit: Motif DnD not working from java to native application
-
- Closed
-
-
JDK-6449992 XDnD test failures
-
- Open
-
-
JDK-6226817 REGRESSION: java/awt/dnd/MotifDnDAcceptanceTest/MotifDnDAcceptanceTest.html failes
-
- Closed
-