Uploaded image for project: 'JDK'
  1. JDK
  2. JDK-6273256

nightly: reg. test java/text/Collator/APITest.java failed

XMLWordPrintable

    • b38
    • generic
    • generic
    • Verified

      Build: I18N Nightly build: 1.6.0-i18n-awt-blade-yy96434_18_May_2005_16_29-b00
      Test: java/text/Collator/APITest.java
      Tested platform: Sol.10 ja, ar; Cinnabar ja; RH AS 3, ja; IA 10, ko; Sol. 9, zh

      One of the failure reports can be found at:
      http://sqeweb/i18n/nightly-results/mustang/i18n_reg_60-i18n_Reg_Sol_10_JDS_ja-en-2005-05-18-21-27-51-0131/failed.html

      The above test failed with the following exception thrown:
      ===================================================================
      #section:main
      ----------messages:(3/113)----------
      command: main APITest
      reason: Assumed action based on file name: run main APITest
      elapsed time (seconds): 3.875
      ----------System.out:(23/1111)----------
      APITest {
        TestGetAll Passed
        TestElemIter Passed
        TestProperty {
          ERROR: Error : ERROR:
      java.lang.RuntimeException: Error : ERROR:

      at CollatorTest.err(CollatorTest.java:253)
      at CollatorTest.errln(CollatorTest.java:258)
      at APITest.TestProperty(APITest.java:107)
      at sun.reflect.NativeMethodAccessorImpl.invoke0(Native Method)
      at sun.reflect.NativeMethodAccessorImpl.invoke(NativeMethodAccessorImpl.java:39)
      at sun.reflect.DelegatingMethodAccessorImpl.invoke(DelegatingMethodAccessorImpl.java:25)
      at java.lang.reflect.Method.invoke(Method.java:585)
      at CollatorTest.run(CollatorTest.java:156)
      at APITest.main(APITest.java:28)
      at sun.reflect.NativeMethodAccessorImpl.invoke0(Native Method)
      at sun.reflect.NativeMethodAccessorImpl.invoke(NativeMethodAccessorImpl.java:39)
      at sun.reflect.DelegatingMethodAccessorImpl.invoke(DelegatingMethodAccessorImpl.java:25)
      at java.lang.reflect.Method.invoke(Method.java:585)
      at com.sun.javatest.regtest.MainWrapper$MainThread.run(MainWrapper.java:94)
      at java.lang.Thread.run(Thread.java:595)
          Uncaught exception thrown in test method TestProperty
      ----------System.err:(18/941)----------
      java.lang.RuntimeException: Uncaught exception thrown in test method TestProperty

      at CollatorTest.err(CollatorTest.java:253)
      at CollatorTest.errln(CollatorTest.java:258)
      at CollatorTest.run(CollatorTest.java:163)
      at APITest.main(APITest.java:28)
      at sun.reflect.NativeMethodAccessorImpl.invoke0(Native Method)
      at sun.reflect.NativeMethodAccessorImpl.invoke(NativeMethodAccessorImpl.java:39)
      at sun.reflect.DelegatingMethodAccessorImpl.invoke(DelegatingMethodAccessorImpl.java:25)
      at java.lang.reflect.Method.invoke(Method.java:585)
      at com.sun.javatest.regtest.MainWrapper$MainThread.run(MainWrapper.java:94)
      at java.lang.Thread.run(Thread.java:595)

      JavaTest Message: Test threw exception: java.lang.RuntimeException: Uncaught exception thrown in test method TestProperty

      JavaTest Message: shutting down test
      ===========================================================================
      Note:
      failed in thie following build:
      1.6.0-i18n-awt-blade-yy96434_18_May_2005_16_29-b00

      passed in thie following build:
      1.6.0-i18n-int-awt-blade-yy96434_18_May_2005_10_24-b00
      1.6.0-i18n-awt-blade-yy96434_18_May_2005_00_26-b00

      ###@###.### 2005-05-19 18:54:06 GMT

            naoto Naoto Sato
            mtiensunw Minchi Tien (Inactive)
            Votes:
            0 Vote for this issue
            Watchers:
            0 Start watching this issue

              Created:
              Updated:
              Resolved:
              Imported:
              Indexed: