Uploaded image for project: 'JDK'
  1. JDK
  2. JDK-6340755

CTE_REGTEST/Generic/4845937/LongArrayChain.java fails with 5.0u6-b03

XMLWordPrintable

    • Icon: Bug Bug
    • Resolution: Duplicate
    • Icon: P3 P3
    • None
    • 5.0u6
    • hotspot
    • gc
    • generic
    • solaris

      CTE_REGTEST/Generic/4845937/LongArrayChain.java fails with 5.0u6-b03

      ----------System.out:(1/12)----------
      Test Failed
      ----------System.err:(2/75)----------
      java full version "1.5.0_06-ea-b02"
      14065 Segmentation Fault - core dumped
      result: Failed. Execution failed: exit code 1

      test result: Failed. Execution failed: exit code 1

      It passes on solaris_x86 with 142_10_b02.
      It passes on solaris9_sparc9 with 5.0u6b03 and 5.0u6b02.

      It fails on solaris_x86 with 1.5.0_05-b05, 1.5.0_06-ea-b01, 1.5.0_06-ea-b02 and 1.5.0_06-as-b03 (5.0u6-b03).

      It passes on solaris9 (update 7) on solaris_x86 with 1.5.0_06-b03.
      It passes on solaris 10 FCS b74l2a.

      Please find attached .jtr, .java and .sh files.
      CTE_REGTEST/Generic/4498286/FontSelection.java fails with 5.0u6-b03

      The following exception is generated:

      java.lang.RuntimeException: Failed
      at Test4498286.main(Test4498286.java:121)
      at sun.reflect.NativeMethodAccessorImpl.invoke0(Native Method)
              at sun.reflect.NativeMethodAccessorImpl.invoke(NativeMethodAccessorImpl.java:39)
      at sun.reflect.DelegatingMethodAccessorImpl.invoke(DelegatingMethodAccessorImpl.java:25)
      at java.lang.reflect.Method.invoke(Method.java:585)
          at com.sun.javatest.regtest.MainWrapper$MainThread.run(MainWrapper.java:83)
      at java.lang.Thread.run(Thread.java:595)

      JavaTest Message: Test threw exception: java.lang.RuntimeException: Failed
      JavaTest Message: shutting down test

      STATUS:Failed.`main' threw exception: java.lang.RuntimeException: Failed
      result: Failed. Execution failed: `main' threw exception: java.lang.RuntimeException: Failed
      STATUS:Failed.`main' threw exception: java.lang.RuntimeException: Failed
      result: Failed. Execution failed: `main' threw exception: java.lang.RuntimeException: Failed

      test result: Failed. Execution failed: `main' threw exception: java.lang.RuntimeException: Failed

      For solaris_x86 it passes with 142_10_b02. It fails with 1.5.0_05-b05, 1.5.0_06-ea-b01, 1.5.0_06-ea-b02 and 1.5.0_06-ea-b03. Result is same whether run with JDS or CDE.

      Ran it with Solaris 10 FCS b74l2a (on sol-sparc) and it failed as well (both JDS & CDE)
      Ran it with Solaris 9 update 7 (on solaris_x86) and if failed as well (both JDS & CDE).

      Please find FontSelection.java and FontSelection.jtr attached.

            Unassigned Unassigned
            rmcphers Raymond Mcpherson (Inactive)
            Votes:
            0 Vote for this issue
            Watchers:
            1 Start watching this issue

              Created:
              Updated:
              Resolved:
              Imported:
              Indexed: