Uploaded image for project: 'JDK'
  1. JDK
  2. JDK-6450725

sun/java2d/SunGraphics2D/EmptyClipRenderingTest.java sometimes fails on Solaris Sparc

XMLWordPrintable

    • Icon: Bug Bug
    • Resolution: Fixed
    • Icon: P3 P3
    • 6
    • 6
    • client-libs
    • 2d
    • b95
    • other
    • solaris_9
    • Verified

      JDK : Fails: Mustang b91
                            Passes: Mustang b90
      Platform[s] : Fails On: Solaris Sparc 9 (default Gnome)
      Failing Test [s] : sun/java2d/SunGraphics2D/EmptyClipRenderingTest.java


          Test source location:
          =====================
      /net/cady/export/jdk1.6.0/latest/ws/j2se/test/sun/java2d/SunGraphics2D/EmptyClipRenderingTest.java

          jtr file location:
          ==================
      /net/cady/export6/results/mustang/b91/reg/regression-reg-sparc9-2006-07-13-17-03-58-0502/workDir/sun/java2d/SunGraphics2D/EmptyClipRenderingTest.jtr

          How to reproduce:
          ====================
          - Set JAVA_HOME to Mustang b91 solaris-sparc
          - cd /net/cady/export/jdk1.6.0/latest/ws/j2se/test/sun/java2d/SunGraphics2D
          - /net/koori.sfbay/onestop/jct-tools/2.1.6/archive/fcs/binaries/solaris/bin/jtreg -r:/tmp -w:/tmp ./EmptyClipRenderingTest.java

          Test output:
          =============
      ----------System.err:(25/1564)----------
      Total number of test rects: 133
      java.lang.RuntimeException: Dest: Screen was rendered to at x=0 y=0 pixel=ffdfdfdf
              at EmptyClipRenderingTest.testResult(EmptyClipRenderingTest.java:221)
              at EmptyClipRenderingTest.<init>(EmptyClipRenderingTest.java:48)
              at EmptyClipRenderingTest.main(EmptyClipRenderingTest.java:238)
              at sun.reflect.NativeMethodAccessorImpl.invoke0(Native Method)
              at sun.reflect.NativeMethodAccessorImpl.invoke(NativeMethodAccessorImpl.java:39)
              at sun.reflect.DelegatingMethodAccessorImpl.invoke(DelegatingMethodAccessorImpl.java:25)
              at java.lang.reflect.Method.invoke(Method.java:589)
              at com.sun.javatest.regtest.MainWrapper$MainThread.run(MainWrapper.java:83)
              at java.lang.Thread.run(Thread.java:619)
      java.lang.RuntimeException: Test FAILED: 1 subtest failures.
              at EmptyClipRenderingTest.<init>(EmptyClipRenderingTest.java:84)
              at EmptyClipRenderingTest.main(EmptyClipRenderingTest.java:238)
              at sun.reflect.NativeMethodAccessorImpl.invoke0(Native Method)
              at sun.reflect.NativeMethodAccessorImpl.invoke(NativeMethodAccessorImpl.java:39)
              at sun.reflect.DelegatingMethodAccessorImpl.invoke(DelegatingMethodAccessorImpl.java:25)
              at java.lang.reflect.Method.invoke(Method.java:589)
              at com.sun.javatest.regtest.MainWrapper$MainThread.run(MainWrapper.java:83)
              at java.lang.Thread.run(Thread.java:619)


          Test Machine:
          ============
      SunOS kalieda 5.9 Generic_118558-11 sun4u sparc SUNW,Sun-Blade-100

            tdv Dmitri Trembovetski (Inactive)
            jaleesunw James Lee (Inactive)
            Votes:
            0 Vote for this issue
            Watchers:
            0 Start watching this issue

              Created:
              Updated:
              Resolved:
              Imported:
              Indexed: