Uploaded image for project: 'JDK'
  1. JDK
  2. JDK-6462061

test javax/swing/text/html/TableView/4690812/bug4690812.java failed on 150u9b1 but passed on 150u8b3

XMLWordPrintable

    • b01
    • x86
    • linux

      test javax/swing/text/html/TableView/4690812/bug4690812.java failed on 150u9b1 but passed on 150u8b3

      ----------System.err:(5/296)----------
      java.lang.RuntimeException: Test failed.
      at bug4690812.destroy(bug4690812.java:70)
      at com.sun.javatest.regtest.AppletWrapper$AppletThread.run(AppletWrapper.java:157)
      at java.lang.Thread.run(Thread.java:595)
      STATUS:Failed.Applet thread threw exception: java.lang.RuntimeException: Test failed.
      result: Failed. Execution failed: Applet thread threw exception: java.lang.RuntimeException: Test failed.

      at if(!passed) {
                  throw new RuntimeException("Test failed.");
              }

      the full test results for appropriate build are attached in tar archive

      - j2se regression WS (local WS was mergered with master location /net/jdk.sfbay/export/jpse04/Regression/1.5.0_j2se/) was used

      To reproduce
      follow the procudere described in http://jqa.ireland/procedures/test_procedures/142_test_procedures/Regression.html
      but just specify parameter -bug:4690812
      to reproduce it

            peterz Peter Zhelezniakov
            edrobitk Eugene Drobitko (Inactive)
            Votes:
            0 Vote for this issue
            Watchers:
            0 Start watching this issue

              Created:
              Updated:
              Resolved:
              Imported:
              Indexed: