Uploaded image for project: 'JDK'
  1. JDK
  2. JDK-6656588

JDK 1.4.2_18 nightly failed error C2109: subscript requires array or pointer type in java_props_md.c

XMLWordPrintable

    • x86
    • windows_2003

      Nightly build failed on Windows-amd64 and Windows-ia64 platforms because of the putback for fixing 6642034.

      Builds succeeded for other platforms.

      Error messages:
      ../../../src\windows\native\java\lang\java_props_md.c(597) : error C2109: subscript requires array or pointer type
      gnumake[4]: *** [C:/BUILD_AREA/jdk142-update/ws/nb/control/build/windows-amd64/tmp/java/java.lang/java/obj64/java_props_md.obj] Error 2

      More details in the partial log files below.

      Thanks in advance,
      Mong

      =======================================================================

      For Windows-amd64:
      ====================
      C:/Progra~1/Micros~1/Bin/Win64/x86/amd64/cl.exe -MD -Zi -Ox -Gy -Op -nologo -W0 -DWIN32 -DIAL -D_AMD64_ -Damd64 -D_LITTLE_ENDIAN -DWIN32_LEAN_AND_MEAN -FdC:/BUILD_AREA/jdk142-update/ws/nb/control/build/windows-amd64/tmp/java/java.lang/java/obj64/ -FeC:/BUILD_AREA/jdk142-update/ws/nb/control/build/windows-amd64/tmp/java/java.lang/java/obj64/ -FmC:/BUILD_AREA/jdk142-update/ws/nb/control/build/windows-amd64/tmp/java/java.lang/java/obj64/ -Wp64 -I. -IC:/BUILD_AREA/jdk142-update/ws/nb/control/build/windows-amd64/tmp/java/java.lang/java/CClassHeaders -I../../../src/windows/javavm/export -I../../../src/share/javavm/export -I../../../src/share/javavm/include -I../../../src/windows/javavm/include -I../../../src/share/native/java/lang/fdlibm/include -I../../../src/share/native/java/io -I../../../src/windows/native/java/util -I../../../src/share/native/common -I../../../src/windows/native/common -I../../../src/share/native/java/lang -I../../../src/windows/native/java/lang -DRELEASE="\"1.4.2_18-nb\"" -DFULL_VERSION="\"1.4.2_18-nb-20080128\"" -c -FoC:/BUILD_AREA/jdk142-update/ws/nb/control/build/windows-amd64/tmp/java/java.lang/java/obj64/jni_util.obj ../../../src/share/native/common/jni_util.c
      jni_util.c
      C:/Progra~1/Micros~1/Bin/Win64/x86/amd64/cl.exe -MD -Zi -Ox -Gy -Op -nologo -W0 -DWIN32 -DIAL -D_AMD64_ -Damd64 -D_LITTLE_ENDIAN -DWIN32_LEAN_AND_MEAN -FdC:/BUILD_AREA/jdk142-update/ws/nb/control/build/windows-amd64/tmp/java/java.lang/java/obj64/ -FeC:/BUILD_AREA/jdk142-update/ws/nb/control/build/windows-amd64/tmp/java/java.lang/java/obj64/ -FmC:/BUILD_AREA/jdk142-update/ws/nb/control/build/windows-amd64/tmp/java/java.lang/java/obj64/ -Wp64 -I. -IC:/BUILD_AREA/jdk142-update/ws/nb/control/build/windows-amd64/tmp/java/java.lang/java/CClassHeaders -I../../../src/windows/javavm/export -I../../../src/share/javavm/export -I../../../src/share/javavm/include -I../../../src/windows/javavm/include -I../../../src/share/native/java/lang/fdlibm/include -I../../../src/share/native/java/io -I../../../src/windows/native/java/util -I../../../src/share/native/common -I../../../src/windows/native/common -I../../../src/share/native/java/lang -I../../../src/windows/native/java/lang -DRELEASE="\"1.4.2_18-nb\"" -DFULL_VERSION="\"1.4.2_18-nb-20080128\"" -c -FoC:/BUILD_AREA/jdk142-update/ws/nb/control/build/windows-amd64/tmp/java/java.lang/java/obj64/check_version.obj ../../../src/share/native/common/check_version.c
      check_version.c
      C:/Progra~1/Micros~1/Bin/Win64/x86/amd64/cl.exe -MD -Zi -Ox -Gy -Op -nologo -W0 -DWIN32 -DIAL -D_AMD64_ -Damd64 -D_LITTLE_ENDIAN -DWIN32_LEAN_AND_MEAN -FdC:/BUILD_AREA/jdk142-update/ws/nb/control/build/windows-amd64/tmp/java/java.lang/java/obj64/ -FeC:/BUILD_AREA/jdk142-update/ws/nb/control/build/windows-amd64/tmp/java/java.lang/java/obj64/ -FmC:/BUILD_AREA/jdk142-update/ws/nb/control/build/windows-amd64/tmp/java/java.lang/java/obj64/ -Wp64 -I. -IC:/BUILD_AREA/jdk142-update/ws/nb/control/build/windows-amd64/tmp/java/java.lang/java/CClassHeaders -I../../../src/windows/javavm/export -I../../../src/share/javavm/export -I../../../src/share/javavm/include -I../../../src/windows/javavm/include -I../../../src/share/native/java/lang/fdlibm/include -I../../../src/share/native/java/io -I../../../src/windows/native/java/util -I../../../src/share/native/common -I../../../src/windows/native/common -I../../../src/share/native/java/lang -I../../../src/windows/native/java/lang -DRELEASE="\"1.4.2_18-nb\"" -DFULL_VERSION="\"1.4.2_18-nb-20080128\"" -c -FoC:/BUILD_AREA/jdk142-update/ws/nb/control/build/windows-amd64/tmp/java/java.lang/java/obj64/java_props_md.obj ../../../src/windows/native/java/lang/java_props_md.c
      java_props_md.c
      ../../../src\windows\native\java\lang\java_props_md.c(597) : error C2109: subscript requires array or pointer type
      gnumake[4]: *** [C:/BUILD_AREA/jdk142-update/ws/nb/control/build/windows-amd64/tmp/java/java.lang/java/obj64/java_props_md.obj] Error 2
      gnumake[4]: Leaving directory `C:/BUILD_AREA/jdk142-update/ws/nb/j2se/make/java/java'
      gnumake[3]: *** [optimized] Error 2
      gnumake[3]: Leaving directory `C:/BUILD_AREA/jdk142-update/ws/nb/j2se/make/java/java'
      gnumake[2]: *** [all] Error 1
      gnumake[2]: Leaving directory `C:/BUILD_AREA/jdk142-update/ws/nb/j2se/make/java'
      gnumake[1]: *** [all] Error 1
      gnumake[1]: Leaving directory `C:/BUILD_AREA/jdk142-update/ws/nb/j2se/make'
      gnumake: *** [j2se-build] Error 2

      For Windows-ia64:
      ====================
      /BUILD_AREA/jdk142-update/ws/nb/control/build/windows-ia64/tmp/java/java.lang/java/obj64/ -FmD:/BUILD_AREA/jdk142-update/ws/nb/control/build/windows-ia64/tmp/java/java.lang/java/obj64/ -Wp64 -I. -ID:/BUILD_AREA/jdk142-update/ws/nb/control/build/windows-ia64/tmp/java/java.lang/java/CClassHeaders -I../../../src/windows/javavm/export -I../../../src/share/javavm/export -I../../../src/share/javavm/include -I../../../src/windows/javavm/include -I../../../src/share/native/java/lang/fdlibm/include -I../../../src/share/native/java/io -I../../../src/windows/native/java/util -I../../../src/share/native/common -I../../../src/windows/native/common -I../../../src/share/native/java/lang -I../../../src/windows/native/java/lang -DRELEASE="\"1.4.2_18-nb\"" -DFULL_VERSION="\"1.4.2_18-nb-20080128\"" -c -FoD:/BUILD_AREA/jdk142-update/ws/nb/control/build/windows-ia64/tmp/java/java.lang/java/obj64/java_props_md.obj ../../../src/windows/native/java/lang/java_props_md.c
      java_props_md.c
      ../../../src\windows\native\java\lang\java_props_md.c(597) : error C2109: subscript requires array or pointer type
      gnumake[4]: *** [D:/BUILD_AREA/jdk142-update/ws/nb/control/build/windows-ia64/tmp/java/java.lang/java/obj64/java_props_md.obj] Error 2
      gnumake[4]: Leaving directory `D:/BUILD_AREA/jdk142-update/ws/nb/j2se/make/java/java'
      gnumake[3]: *** [optimized] Error 2
      gnumake[3]: Leaving directory `D:/BUILD_AREA/jdk142-update/ws/nb/j2se/make/java/java'
      gnumake[2]: *** [all] Error 1
      gnumake[2]: Leaving directory `D:/BUILD_AREA/jdk142-update/ws/nb/j2se/make/java'
      gnumake[1]: *** [all] Error 1
      gnumake[1]: Leaving directory `D:/BUILD_AREA/jdk142-update/ws/nb/j2se/make'
      gnumake: *** [j2se-build] Error 2

            asaha Abhijit Saha
            mtvo Hang Vo (Inactive)
            Votes:
            0 Vote for this issue
            Watchers:
            1 Start watching this issue

              Created:
              Updated:
              Resolved:
              Imported:
              Indexed: