-
Bug
-
Resolution: Cannot Reproduce
-
P4
-
None
-
7
-
x86
-
windows_vista
The error message is:
status=Failed. Execution failed: Applet thread threw exception: java.lang.RuntimeException: Test failed. Exception thrown: java.lang.RuntimeException: Test failed. Choice should generate MouseDragged events outside Choice
The full log file attached.
status=Failed. Execution failed: Applet thread threw exception: java.lang.RuntimeException: Test failed. Exception thrown: java.lang.RuntimeException: Test failed. Choice should generate MouseDragged events outside Choice
The full log file attached.