-
Bug
-
Resolution: Cannot Reproduce
-
P4
-
None
-
7
-
x86
-
windows_vista
The error is:
STATUS:Failed.Applet thread threw exception: java.lang.RuntimeException: The test was not completed. java.lang.RuntimeException: GrabLockTest failed.0
The log file is attached.
STATUS:Failed.Applet thread threw exception: java.lang.RuntimeException: The test was not completed. java.lang.RuntimeException: GrabLockTest failed.0
The log file is attached.