Uploaded image for project: 'JDK'
  1. JDK
  2. JDK-6737784

JDK 5.0u17 build from integration workspace failed due to "cannot find symbol symbol: variable _lap"

XMLWordPrintable

    • b01
    • x86
    • linux_redhat_2.1
    • Verified

      Hi,

      Build from the integration workspace failed for Windows-i586, Linux-i586, Solaris-sparc, and Solaris-i586 platforms with the same error messages below.
      or
      Full log files: /net/mizu.sfbay/n/tiger/jdk1.5.0_17/logs/20080815/build*.log

      Could someone please look into this failure ASAP as this build is for SSR08_03 b01?

      Integration ws: /net/nightsvr.sfbay/export4/integration/5.0u17/

      Thanks in advance,
      Mong

      =========================================================
      Linux-i586 platform.

      /bin/chmod a+rw /BUILD_AREA/jdk1.5.0_17/control/build/linux-i586/tmp/deploy/javaws/lib/javaws/messages_sv.properties
      /bin/cp -f ../../src/javaws/share/native/messages_zh_CN.properties /BUILD_AREA/jdk1.5.0_17/control/build/linux-i586/tmp/deploy/javaws/lib/javaws/messages_zh_CN.properties
      /bin/chmod a+rw /BUILD_AREA/jdk1.5.0_17/control/build/linux-i586/tmp/deploy/javaws/lib/javaws/messages_zh_CN.properties
      /bin/cp -f /BUILD_AREA/jdk1.5.0_17/control/build/linux-i586/tmp/deploy/l10n/messages_zh_HK.properties /BUILD_AREA/jdk1.5.0_17/control/build/linux-i586/tmp/deploy/javaws/lib/javaws/messages_zh_HK.properties
      /bin/chmod a+rw /BUILD_AREA/jdk1.5.0_17/control/build/linux-i586/tmp/deploy/javaws/lib/javaws/messages_zh_HK.properties
      /bin/sed s/##RELEASE##/1.5.0_17-ea/g ../../src/javaws/share/classes/com/sun/javaws/Globals_pre.java > /BUILD_AREA/jdk1.5.0_17/control/build/linux-i586/tmp/deploy/javaws/jawsgensrc/classes/com/sun/javaws/Globals.java
      /bin/sed s/##RELEASE##/1.5.0_17-ea/g ../../src/javaws/share/classes/com/sun/javaws/jardiff/resources/strings.properties > /BUILD_AREA/jdk1.5.0_17/control/build/linux-i586/tmp/deploy/javaws/jawsClasses/./com/sun/javaws/jardiff/resources/strings.properties
      /BUILD_AREA/jdk1.5.0_17/control/build/linux-i586/bin/javac -source 1.2 -target 1.2 -classpath "/BUILD_AREA/jdk1.5.0_17/control/build/linux-i586/tmp/deploy/javaws/jawsClasses/.:../../src/javaws/share/classes:../../src/javaws/linux/classes:../../src/javaws/unix/classes:/BUILD_AREA/jdk1.5.0_17/control/build/linux-i586/tmp/deploy/javaws/jawsgensrc/classes:/BUILD_AREA/jdk1.5.0_17/control/build/linux-i586/tmp/deploy/deployClasses" -d /BUILD_AREA/jdk1.5.0_17/control/build/linux-i586/tmp/deploy/javaws/jawsClasses/. ../../src/javaws/share/classes/com/sun/javaws/NativeLibrary.java
      /BUILD_AREA/jdk1.5.0_17/control/build/linux-i586/bin/javac -source 1.2 -target 1.2 -classpath "/BUILD_AREA/jdk1.5.0_17/control/build/linux-i586/tmp/deploy/javaws/jawsClasses/.:../../src/javaws/share/classes:../../src/javaws/linux/classes:../../src/javaws/unix/classes:/BUILD_AREA/jdk1.5.0_17/control/build/linux-i586/tmp/deploy/javaws/jawsgensrc/classes:/BUILD_AREA/jdk1.5.0_17/control/build/linux-i586/tmp/deploy/deployClasses" -d /BUILD_AREA/jdk1.5.0_17/control/build/linux-i586/tmp/deploy/javaws/jawsClasses/. ../../src/javaws/share/classes/com/sun/javaws/LocalApplicationProperties.java
      ./../src/javaws/share/classes/com/sun/javaws/Launcher.java:953: cannot find symbol
      symbol : variable _lap
      location: class com.sun.javaws.Launcher
      ld.isSecure() ? null : installDir, _lap,
                                                                 ^
      Note: Some input files use or override a deprecated API.
      Note: Recompile with -Xlint:deprecation for details.
      1 error
      gnumake[4]: *** [/BUILD_AREA/jdk1.5.0_17/control/build/linux-i586/tmp/deploy/javaws/jawsClasses/./com/sun/javaws/LocalApplicationProperties.class] Error 1
      rm /BUILD_AREA/jdk1.5.0_17/control/build/linux-i586/tmp/deploy/l10n/messages_zh_HK.properties
      gnumake[4]: Leaving directory `/BUILD_AREA/jdk1.5.0_17/deploy/make/javaws'
      gnumake[3]: *** [optimized] Error 2
      rm /BUILD_AREA/jdk1.5.0_17/control/build/linux-i586/tmp/deploy/l10n/com/sun/deploy/resources/Deployment_zh_HK.java
      gnumake[3]: Leaving directory `/BUILD_AREA/jdk1.5.0_17/deploy/make/javaws'
      gnumake[2]: *** [installer-int] Error 2
      gnumake[2]: Leaving directory `/BUILD_AREA/jdk1.5.0_17/deploy/make/javaws'
      gnumake[1]: *** [javaws-all] Error 2
      gnumake[1]: Leaving directory `/BUILD_AREA/jdk1.5.0_17/deploy/make'
      gnumake: *** [deploy-build] Error 2

            wrockett Walter Rockett (Inactive)
            mtvo Hang Vo (Inactive)
            Votes:
            0 Vote for this issue
            Watchers:
            2 Start watching this issue

              Created:
              Updated:
              Resolved:
              Imported:
              Indexed: