Uploaded image for project: 'JDK'
  1. JDK
  2. JDK-6752385

SSR08_03 JDK 1.3.1_24 fcs b03 failed due to t2kScalerContext.cpp(358) : error C2561:

XMLWordPrintable

    • b03
    • x86
    • windows_nt
    • Verified

      Hi,

      Build failed from Master workspace due to today's putback of fix 6733336 (Crash on malformed font).

      Please fix this issue ASAP and/or backout this failure from Master/Integration workspace.

      Full log files: /net/mizu.sfbay/n/prod2/jdk131-update/logs/build*.log

      Thanks,
      Mong

      Partial log file on windows-i586 platform
      =========================================
      C:/PROGRA~1/MICROS~1/VC98/Bin/cl.exe -MD -Zi -Ox -GB -Os -Gy -DCC_NOEX -nologo -DWIN32 -DIAL -D_X86_ -Dx86 -D_LITTLE_ENDIAN -DWIN32_LEAN_AND_MEAN -Fd../../../build/win32/tmp/sun/sun.awt.font/fontmanager/obj/ -Fe../../../build/win32/tmp/sun/sun.awt.font/fontmanager/obj/ -Fm../../../build/win32/tmp/sun/sun.awt.font/fontmanager/obj/ -I. -I../../../build/win32/tmp/sun/sun.awt.font/fontmanager/CClassHeaders -I../../../src/win32/javavm/export -I../../../src/share/javavm/export -I../../../src/share/native/common -I../../../src/win32/native/common -I../../../src/share/native/sun/awt/font -I../../../src/win32/native/sun/awt/font -I../../../src/share/native/sun/awt/font -I../../../src/share/native/sun/awt/font/fontmanager/include -I../../../src/share/native/sun/awt/font/t2k -I../../../src/share/native/sun/awt/font/layout -I../../../src/share/native/sun/awt/font/opentype -I../../../src/share/native/sun/awt/font/layoutengine -I../../../src/share/native/sun/awt/image/cvutils -I../../../src/win32/native/sun/awt -I../../../src/share/native/sun/awt/debug -I../../../src/share/native/sun/java2d/loops -I../../../src/share/native/sun/java2d -I/include -I../../../src/win32/native/sun/windows -c -Fo../../../build/win32/tmp/sun/sun.awt.font/fontmanager/obj/t2kScalerContext.obj ../../../src/share/native/sun/awt/font/fontmanager/fontobjects/t2kScalerContext.cpp^M
      t2kScalerContext.cpp^M
      ../../../src/share/native/sun/awt/font/fontmanager/fontobjects/t2kScalerContext.cpp(358) : error C2561: 'SetupTrans' : function must return a value^M
      gnumake[3]: *** [../../../build/win32/tmp/sun/sun.awt.font/fontmanager/obj/t2kScalerContext.obj] Error 2^M
      gnumake[2]: *** [optimized] Error 2^M
      gnumake[1]: *** [all] Error 1^M
      gnumake: *** [all] Error 1^M
              ../../../src/share/native/sun/awt/font/fontmanager/include\t2kScalerContext.h(30) : see declaration of 'SetupTrans'^M
      gnumake[3]: Leaving directory `D:/BUILD_AREA/jdk131-update/ws/fcs/jdk/make/sun/font'^M
      gnumake[2]: Leaving directory `D:/BUILD_AREA/jdk131-update/ws/fcs/jdk/make/sun/font'^M
      gnumake[1]: Leaving directory `D:/BUILD_AREA/jdk131-update/ws/fcs/jdk/make/sun'^M

            asaha Abhijit Saha
            mtvo Hang Vo (Inactive)
            Votes:
            0 Vote for this issue
            Watchers:
            4 Start watching this issue

              Created:
              Updated:
              Resolved:
              Imported:
              Indexed: