-
Bug
-
Resolution: Won't Fix
-
P3
-
None
-
1.4.2
-
generic
-
generic
nsk/jdwp/Method/VariableTable/vartable001 intermediately crash 1.4.2 64 bit server VM.
Platform: solaris-i586 VM Arch: solaris-amd64
Machine: stt-12 Info: SunOS stt-12 5.10 Generic_127112-11 i86pc i386 i86pc
JDK: Java(TM) 2 Runtime Environment, Standard Edition (build 1.4.2_17-b06)
VM: Java HotSpot(TM) 64-Bit Server VM (build 1.4.2_17-b06, mixed mode)
Testbase: VM 1.4.2
Suite: vm.full (tonga)
Options: -d64 -server -Xmixed
#
[2008-10-17T22:56:46.43] export CLASSPATH
[2008-10-17T22:56:46.43] export PERL
[2008-10-17T22:56:46.43] export PATH
[2008-10-17T22:56:46.43] export TESTLIST
[2008-10-17T22:56:46.43] export HOME
[2008-10-17T22:56:46.43] export DISPLAY
[2008-10-17T22:56:46.43] export LD_LIBRARY_PATH
[2008-10-17T22:56:46.43] TEST_DEST_DIR="vartable001"
[2008-10-17T22:56:56.58] # Actual: TEST_DEST_DIR=vartable001
[2008-10-17T22:56:56.58] TESTNAME="${test_case_name}"
[2008-10-17T22:56:56.58] # Actual: TESTNAME=vartable001
[2008-10-17T22:56:56.58] testName="nsk/jdwp/Method/VariableTable//vartable001"
[2008-10-17T22:56:56.58] # Actual: testName=nsk/jdwp/Method/VariableTable//vartable001
[2008-10-17T22:56:56.58] TESTDIR="${test_work_dir}"
[2008-10-17T22:56:56.58] # Actual: TESTDIR=/net/stt-13/export/stt/gtee/global/1.4.2_17/b06/142_VM/03/vm/solaris-amd64/solaris-amd64_11D0C2D1D9A/stt-robot.SunOS.x86/vartable001
[2008-10-17T22:56:56.58] testWorkDir="${test_work_dir}/"
[2008-10-17T22:56:56.58] # Actual: testWorkDir=/net/stt-13/export/stt/gtee/global/1.4.2_17/b06/142_VM/03/vm/solaris-amd64/solaris-amd64_11D0C2D1D9A/stt-robot.SunOS.x86/vartable001/
[2008-10-17T22:56:56.58] export testWorkDir
[2008-10-17T22:56:56.58] tlogOutFile="${test_work_dir}/${test_name}.tlog"
[2008-10-17T22:56:56.58] # Actual: tlogOutFile=/net/stt-13/export/stt/gtee/global/1.4.2_17/b06/142_VM/03/vm/solaris-amd64/solaris-amd64_11D0C2D1D9A/stt-robot.SunOS.x86/vartable001/vartable001.tlog
[2008-10-17T22:56:56.58] testErrFile="${test_work_dir}/${test_name}.err"
[2008-10-17T22:56:56.58] # Actual: testErrFile=/net/stt-13/export/stt/gtee/global/1.4.2_17/b06/142_VM/03/vm/solaris-amd64/solaris-amd64_11D0C2D1D9A/stt-robot.SunOS.x86/vartable001/vartable001.err
[2008-10-17T22:56:56.58] EXECUTE_CLASS="${test_name}"
[2008-10-17T22:56:56.58] # Actual: EXECUTE_CLASS=vartable001
[2008-10-17T22:56:56.58] JAVAC_OPTS="${JAVAC_OPTS} -g"
[2008-10-17T22:56:56.58] # Actual: JAVAC_OPTS=-g
[2008-10-17T22:56:56.58] TEST_ARGS="${JDWP_TEST_KEYS} -debugee.vmkeys=${JDWP_DEBUGEE_VM_KEYS}"
[2008-10-17T22:56:56.58] # Actual: TEST_ARGS=-debugee.vmkeys=-d64
[2008-10-17T22:56:56.58] EXECUTE_CLASS="nsk.jdwp.Method.VariableTable.vartable001"
[2008-10-17T22:56:56.58] # Actual: EXECUTE_CLASS=nsk.jdwp.Method.VariableTable.vartable001
[2008-10-17T22:56:56.58] APPLICATION_TIMEOUT="${TIMEOUT}"
[2008-10-17T22:56:56.58] # Actual: APPLICATION_TIMEOUT=20
[2008-10-17T22:56:56.58] CLASSPATH="${test_work_dir}${PS}${CLASSPATH}"
[2008-10-17T22:56:56.58] # Actual: CLASSPATH=/net/stt-13/export/stt/gtee/global/1.4.2_17/b06/142_VM/03/vm/solaris-amd64/solaris-amd64_11D0C2D1D9A/stt-robot.SunOS.x86/vartable001:/net/stt-13/export/home0/dtf/dtf_ws/suites/142_Suites//vm/src/classes::/export/jdk/j2sdk1.4.2_17/lib/tools.jar:/net/vice.russia/export/stt/newroot/dtf/dtf_ws/suites/142_Suites/share/harness/tonga/tonga3.0.jar:/net/vice.russia/export/stt/newroot/dtf/dtf_ws/suites/142_Suites/share/harness/javatest/javatest.jar
[2008-10-17T22:56:56.58] export CLASSPATH
[2008-10-17T22:56:56.59] ${JAVA} ${JAVA_OPTS} ${EXECUTE_CLASS} ${TEST_ARGS}
[2008-10-17T22:56:56.60] # Actual: /export/jdk/j2sdk1.4.2_17/bin/java -d64 nsk.jdwp.Method.VariableTable.vartable001 -debugee.vmkeys=-d64
[2008-10-17T22:56:56.60] debugee.stdout> #
[2008-10-17T22:57:10.38] debugee.stdout> # An unexpected error has been detected by HotSpot Virtual Machine:
[2008-10-17T22:57:10.38] debugee.stdout> #
[2008-10-17T22:57:10.38] debugee.stdout> # SIGSEGV (0xb) at pc=0xfffffd7fff2ef57c, pid=3483, tid=1
[2008-10-17T22:57:10.38] debugee.stdout> #
[2008-10-17T22:57:10.38] debugee.stdout> # Java VM: Java HotSpot(TM) 64-Bit Server VM (1.4.2_17-b06 mixed mode)
[2008-10-17T22:57:10.38] debugee.stdout> # Problematic frame:
[2008-10-17T22:57:10.38] debugee.stdout> # C [libc.so.1+0x6f57c] malloc+0x10c
[2008-10-17T22:57:10.38] debugee.stdout> #
[2008-10-17T22:57:10.38] debugee.stdout> # An error report file with more information is saved as hs_err_pid3483.log
[2008-10-17T22:57:10.38] debugee.stdout> #
[2008-10-17T22:57:10.38] debugee.stdout> # If you would like to submit a bug report, please visit:
[2008-10-17T22:57:10.38] debugee.stdout> # http://java.sun.com/webapps/bugreport/crash.jsp
[2008-10-17T22:57:10.38] debugee.stdout> #
[2008-10-17T22:57:10.38] java.io.EOFException
[2008-10-17T22:57:10.38] at java.io.ObjectInputStream$BlockDataInputStream.peekByte(ObjectInputStream.java:2425)
[2008-10-17T22:57:10.38] at java.io.ObjectInputStream.readObject0(ObjectInputStream.java:1245)
[2008-10-17T22:57:10.38] at java.io.ObjectInputStream.readObject(ObjectInputStream.java:322)
[2008-10-17T22:57:10.38] at nsk.share.jpda.SocketConnection.doReadObject(SocketConnection.java:615)
[2008-10-17T22:57:10.38] at nsk.share.jpda.SocketConnection.readObject(SocketConnection.java:535)
[2008-10-17T22:57:10.39] at nsk.share.jpda.IOPipe.readln(IOPipe.java:157)
[2008-10-17T22:57:10.39] at nsk.jdwp.Method.VariableTable.vartable001.prepareDebugee(vartable001.java:203)
[2008-10-17T22:57:10.39] at nsk.jdwp.Method.VariableTable.vartable001.runIt(vartable001.java:139)
[2008-10-17T22:57:10.39] at nsk.jdwp.Method.VariableTable.vartable001.run(vartable001.java:113)
[2008-10-17T22:57:10.39] at nsk.jdwp.Method.VariableTable.vartable001.main(vartable001.java:106)
[2008-10-17T22:57:10.39] #>
[2008-10-17T22:57:10.39] #> WARNING: switching log to verbose mode,
[2008-10-17T22:57:10.39] #> because error is complained
[2008-10-17T22:57:10.39] #>
[2008-10-17T22:57:10.39]
[2008-10-17T22:57:10.39] >>> Preparing debugee for testing
[2008-10-17T22:57:10.39]
[2008-10-17T22:57:10.39] Launching debugee
[2008-10-17T22:57:10.39] Debugee> Starting java process:
[2008-10-17T22:57:10.39] /export/jdk/j2sdk1.4.2_17/jre/bin/java "-d64" "-Xdebug" "-Xrunjdwp:server=y,transport=dt_socket,address=8000" "nsk.jdwp.Method.VariableTable.vartable001a" "-debugee.vmkeys=-d64"
[2008-10-17T22:57:10.39] Debugee> Establishing JDWP socket connection
[2008-10-17T22:57:10.39] Debugee> Attaching to debugee: localhost:8000
[2008-10-17T22:57:10.39] transport> Attempt #0 to establish JDWP socket connection failed:
[2008-10-17T22:57:10.39] java.net.ConnectException: Connection refused
[2008-10-17T22:57:10.39] transport> JDWP socket connection established
[2008-10-17T22:57:10.39] Waiting for VM_INIT event
[2008-10-17T22:57:10.48] Querying for IDSizes
[2008-10-17T22:57:10.48] Resuming debugee VM
[2008-10-17T22:57:10.48] Waiting for signal from debugee: ready
[2008-10-17T22:57:10.48] # ERROR: TEST FAILED: Cought Exception while reading an object from IOPipe connection:
[2008-10-17T22:57:10.48] # ERROR: java.io.EOFException
[2008-10-17T22:57:10.48] # ERROR: TEST FAILED
[2008-10-17T22:57:10.48] # ERROR: Debugee> Debugee VM has not exited correctly: trying to kill it
[2008-10-17T22:57:10.48]
[2008-10-17T22:57:10.48]
[2008-10-17T22:57:10.48] #>
[2008-10-17T22:57:10.48] #> SUMMARY: Following errors occured
[2008-10-17T22:57:10.48] #> during test execution:
[2008-10-17T22:57:10.48] #>
[2008-10-17T22:57:10.48] # ERROR: TEST FAILED: Cought Exception while reading an object from IOPipe connection:
[2008-10-17T22:57:10.48] # ERROR: java.io.EOFException
[2008-10-17T22:57:10.48] # ERROR: TEST FAILED
[2008-10-17T22:57:10.48] # ERROR: Debugee> Debugee VM has not exited correctly: trying to kill it
[2008-10-17T22:57:10.48] # Test level exit status: 97
[2008-10-17T22:57:11.51]
Full logs:
http://vice.russia/gtee/1.4.2_17/b06/142_VM/03/vm/solaris-amd64/solaris-amd64_11D0C2D1D9A/stt-robot.SunOS.x86/vartable001/
Platform: solaris-i586 VM Arch: solaris-amd64
Machine: stt-12 Info: SunOS stt-12 5.10 Generic_127112-11 i86pc i386 i86pc
JDK: Java(TM) 2 Runtime Environment, Standard Edition (build 1.4.2_17-b06)
VM: Java HotSpot(TM) 64-Bit Server VM (build 1.4.2_17-b06, mixed mode)
Testbase: VM 1.4.2
Suite: vm.full (tonga)
Options: -d64 -server -Xmixed
#
[2008-10-17T22:56:46.43] export CLASSPATH
[2008-10-17T22:56:46.43] export PERL
[2008-10-17T22:56:46.43] export PATH
[2008-10-17T22:56:46.43] export TESTLIST
[2008-10-17T22:56:46.43] export HOME
[2008-10-17T22:56:46.43] export DISPLAY
[2008-10-17T22:56:46.43] export LD_LIBRARY_PATH
[2008-10-17T22:56:46.43] TEST_DEST_DIR="vartable001"
[2008-10-17T22:56:56.58] # Actual: TEST_DEST_DIR=vartable001
[2008-10-17T22:56:56.58] TESTNAME="${test_case_name}"
[2008-10-17T22:56:56.58] # Actual: TESTNAME=vartable001
[2008-10-17T22:56:56.58] testName="nsk/jdwp/Method/VariableTable//vartable001"
[2008-10-17T22:56:56.58] # Actual: testName=nsk/jdwp/Method/VariableTable//vartable001
[2008-10-17T22:56:56.58] TESTDIR="${test_work_dir}"
[2008-10-17T22:56:56.58] # Actual: TESTDIR=/net/stt-13/export/stt/gtee/global/1.4.2_17/b06/142_VM/03/vm/solaris-amd64/solaris-amd64_11D0C2D1D9A/stt-robot.SunOS.x86/vartable001
[2008-10-17T22:56:56.58] testWorkDir="${test_work_dir}/"
[2008-10-17T22:56:56.58] # Actual: testWorkDir=/net/stt-13/export/stt/gtee/global/1.4.2_17/b06/142_VM/03/vm/solaris-amd64/solaris-amd64_11D0C2D1D9A/stt-robot.SunOS.x86/vartable001/
[2008-10-17T22:56:56.58] export testWorkDir
[2008-10-17T22:56:56.58] tlogOutFile="${test_work_dir}/${test_name}.tlog"
[2008-10-17T22:56:56.58] # Actual: tlogOutFile=/net/stt-13/export/stt/gtee/global/1.4.2_17/b06/142_VM/03/vm/solaris-amd64/solaris-amd64_11D0C2D1D9A/stt-robot.SunOS.x86/vartable001/vartable001.tlog
[2008-10-17T22:56:56.58] testErrFile="${test_work_dir}/${test_name}.err"
[2008-10-17T22:56:56.58] # Actual: testErrFile=/net/stt-13/export/stt/gtee/global/1.4.2_17/b06/142_VM/03/vm/solaris-amd64/solaris-amd64_11D0C2D1D9A/stt-robot.SunOS.x86/vartable001/vartable001.err
[2008-10-17T22:56:56.58] EXECUTE_CLASS="${test_name}"
[2008-10-17T22:56:56.58] # Actual: EXECUTE_CLASS=vartable001
[2008-10-17T22:56:56.58] JAVAC_OPTS="${JAVAC_OPTS} -g"
[2008-10-17T22:56:56.58] # Actual: JAVAC_OPTS=-g
[2008-10-17T22:56:56.58] TEST_ARGS="${JDWP_TEST_KEYS} -debugee.vmkeys=${JDWP_DEBUGEE_VM_KEYS}"
[2008-10-17T22:56:56.58] # Actual: TEST_ARGS=-debugee.vmkeys=-d64
[2008-10-17T22:56:56.58] EXECUTE_CLASS="nsk.jdwp.Method.VariableTable.vartable001"
[2008-10-17T22:56:56.58] # Actual: EXECUTE_CLASS=nsk.jdwp.Method.VariableTable.vartable001
[2008-10-17T22:56:56.58] APPLICATION_TIMEOUT="${TIMEOUT}"
[2008-10-17T22:56:56.58] # Actual: APPLICATION_TIMEOUT=20
[2008-10-17T22:56:56.58] CLASSPATH="${test_work_dir}${PS}${CLASSPATH}"
[2008-10-17T22:56:56.58] # Actual: CLASSPATH=/net/stt-13/export/stt/gtee/global/1.4.2_17/b06/142_VM/03/vm/solaris-amd64/solaris-amd64_11D0C2D1D9A/stt-robot.SunOS.x86/vartable001:/net/stt-13/export/home0/dtf/dtf_ws/suites/142_Suites//vm/src/classes::/export/jdk/j2sdk1.4.2_17/lib/tools.jar:/net/vice.russia/export/stt/newroot/dtf/dtf_ws/suites/142_Suites/share/harness/tonga/tonga3.0.jar:/net/vice.russia/export/stt/newroot/dtf/dtf_ws/suites/142_Suites/share/harness/javatest/javatest.jar
[2008-10-17T22:56:56.58] export CLASSPATH
[2008-10-17T22:56:56.59] ${JAVA} ${JAVA_OPTS} ${EXECUTE_CLASS} ${TEST_ARGS}
[2008-10-17T22:56:56.60] # Actual: /export/jdk/j2sdk1.4.2_17/bin/java -d64 nsk.jdwp.Method.VariableTable.vartable001 -debugee.vmkeys=-d64
[2008-10-17T22:56:56.60] debugee.stdout> #
[2008-10-17T22:57:10.38] debugee.stdout> # An unexpected error has been detected by HotSpot Virtual Machine:
[2008-10-17T22:57:10.38] debugee.stdout> #
[2008-10-17T22:57:10.38] debugee.stdout> # SIGSEGV (0xb) at pc=0xfffffd7fff2ef57c, pid=3483, tid=1
[2008-10-17T22:57:10.38] debugee.stdout> #
[2008-10-17T22:57:10.38] debugee.stdout> # Java VM: Java HotSpot(TM) 64-Bit Server VM (1.4.2_17-b06 mixed mode)
[2008-10-17T22:57:10.38] debugee.stdout> # Problematic frame:
[2008-10-17T22:57:10.38] debugee.stdout> # C [libc.so.1+0x6f57c] malloc+0x10c
[2008-10-17T22:57:10.38] debugee.stdout> #
[2008-10-17T22:57:10.38] debugee.stdout> # An error report file with more information is saved as hs_err_pid3483.log
[2008-10-17T22:57:10.38] debugee.stdout> #
[2008-10-17T22:57:10.38] debugee.stdout> # If you would like to submit a bug report, please visit:
[2008-10-17T22:57:10.38] debugee.stdout> # http://java.sun.com/webapps/bugreport/crash.jsp
[2008-10-17T22:57:10.38] debugee.stdout> #
[2008-10-17T22:57:10.38] java.io.EOFException
[2008-10-17T22:57:10.38] at java.io.ObjectInputStream$BlockDataInputStream.peekByte(ObjectInputStream.java:2425)
[2008-10-17T22:57:10.38] at java.io.ObjectInputStream.readObject0(ObjectInputStream.java:1245)
[2008-10-17T22:57:10.38] at java.io.ObjectInputStream.readObject(ObjectInputStream.java:322)
[2008-10-17T22:57:10.38] at nsk.share.jpda.SocketConnection.doReadObject(SocketConnection.java:615)
[2008-10-17T22:57:10.38] at nsk.share.jpda.SocketConnection.readObject(SocketConnection.java:535)
[2008-10-17T22:57:10.39] at nsk.share.jpda.IOPipe.readln(IOPipe.java:157)
[2008-10-17T22:57:10.39] at nsk.jdwp.Method.VariableTable.vartable001.prepareDebugee(vartable001.java:203)
[2008-10-17T22:57:10.39] at nsk.jdwp.Method.VariableTable.vartable001.runIt(vartable001.java:139)
[2008-10-17T22:57:10.39] at nsk.jdwp.Method.VariableTable.vartable001.run(vartable001.java:113)
[2008-10-17T22:57:10.39] at nsk.jdwp.Method.VariableTable.vartable001.main(vartable001.java:106)
[2008-10-17T22:57:10.39] #>
[2008-10-17T22:57:10.39] #> WARNING: switching log to verbose mode,
[2008-10-17T22:57:10.39] #> because error is complained
[2008-10-17T22:57:10.39] #>
[2008-10-17T22:57:10.39]
[2008-10-17T22:57:10.39] >>> Preparing debugee for testing
[2008-10-17T22:57:10.39]
[2008-10-17T22:57:10.39] Launching debugee
[2008-10-17T22:57:10.39] Debugee> Starting java process:
[2008-10-17T22:57:10.39] /export/jdk/j2sdk1.4.2_17/jre/bin/java "-d64" "-Xdebug" "-Xrunjdwp:server=y,transport=dt_socket,address=8000" "nsk.jdwp.Method.VariableTable.vartable001a" "-debugee.vmkeys=-d64"
[2008-10-17T22:57:10.39] Debugee> Establishing JDWP socket connection
[2008-10-17T22:57:10.39] Debugee> Attaching to debugee: localhost:8000
[2008-10-17T22:57:10.39] transport> Attempt #0 to establish JDWP socket connection failed:
[2008-10-17T22:57:10.39] java.net.ConnectException: Connection refused
[2008-10-17T22:57:10.39] transport> JDWP socket connection established
[2008-10-17T22:57:10.39] Waiting for VM_INIT event
[2008-10-17T22:57:10.48] Querying for IDSizes
[2008-10-17T22:57:10.48] Resuming debugee VM
[2008-10-17T22:57:10.48] Waiting for signal from debugee: ready
[2008-10-17T22:57:10.48] # ERROR: TEST FAILED: Cought Exception while reading an object from IOPipe connection:
[2008-10-17T22:57:10.48] # ERROR: java.io.EOFException
[2008-10-17T22:57:10.48] # ERROR: TEST FAILED
[2008-10-17T22:57:10.48] # ERROR: Debugee> Debugee VM has not exited correctly: trying to kill it
[2008-10-17T22:57:10.48]
[2008-10-17T22:57:10.48]
[2008-10-17T22:57:10.48] #>
[2008-10-17T22:57:10.48] #> SUMMARY: Following errors occured
[2008-10-17T22:57:10.48] #> during test execution:
[2008-10-17T22:57:10.48] #>
[2008-10-17T22:57:10.48] # ERROR: TEST FAILED: Cought Exception while reading an object from IOPipe connection:
[2008-10-17T22:57:10.48] # ERROR: java.io.EOFException
[2008-10-17T22:57:10.48] # ERROR: TEST FAILED
[2008-10-17T22:57:10.48] # ERROR: Debugee> Debugee VM has not exited correctly: trying to kill it
[2008-10-17T22:57:10.48] # Test level exit status: 97
[2008-10-17T22:57:11.51]
Full logs:
http://vice.russia/gtee/1.4.2_17/b06/142_VM/03/vm/solaris-amd64/solaris-amd64_11D0C2D1D9A/stt-robot.SunOS.x86/vartable001/