-
Bug
-
Resolution: Won't Fix
-
P4
-
None
-
1.4.2
-
generic
-
generic
VM test nsk/regression/b4322869 fail on 1.4.2 amd64 JVM. This is not regtression. The test fail with 1.4.2_13 and 1.4.2_17 and 1.4.2_18.
Platform: windows-amd64 VM Arch: windows-amd64
Machine: STT-44 Info: Windows_NT STT-44 5 02 8664
JDK: Java(TM) 2 Runtime Environment, Standard Edition (build 1.4.2_17-b06)
VM: Java HotSpot(TM) 64-Bit Server VM (build 1.4.2_17-b06, mixed mode)
Testbase: VM 1.4.2
Suite: vm.full (tonga)
Options: -server -Xmixed
[2008-11-12T16:14:26.50] # Actual: C:/jdk/j2sdk1.4.2_17/windows-amd64/bin/java b4322869 20
[2008-11-12T16:14:26.50] ==> nsk/regression/b4322869 TEST LOG:
[2008-11-12T16:22:26.76] --> This test for #4322869 bug; Category: hotspot; Subcategory: compiler1
[2008-11-12T16:22:26.76] Synopsis: race condition when returning from native calls with oop result
[2008-11-12T16:22:26.76]
[2008-11-12T16:22:26.76] --> b4322869: test execution time limit = 18 minutes
[2008-11-12T16:22:26.76] --> b4322869: Thread "NativeOopThread" started
[2008-11-12T16:22:26.76] --> b4322869: test execution time = 2m. 0s
[2008-11-12T16:22:26.76] --> number of made checks for last time interval = 337720906
[2008-11-12T16:22:26.76] --> total number of made checks = 337720906
[2008-11-12T16:22:26.76] --> b4322869: test execution time = 4m. 0s
[2008-11-12T16:22:26.76] --> number of made checks for last time interval = 336850040
[2008-11-12T16:22:26.76] --> total number of made checks = 674570946
[2008-11-12T16:22:26.76] --> b4322869: test execution time = 6m. 0s
[2008-11-12T16:22:26.76] --> number of made checks for last time interval = 334840388
[2008-11-12T16:22:26.76] --> total number of made checks = 1009411334
[2008-11-12T16:22:26.76] --> b4322869: test execution time = 8m. 0s
[2008-11-12T16:22:26.76] --> number of made checks for last time interval = 335004917
[2008-11-12T16:22:26.76] --> total number of made checks = 1344416251
[2008-11-12T16:27:13.59] --> b4322869: test execution time = 10m. 0s
[2008-11-12T16:27:13.59] --> number of made checks for last time interval = 335436742
[2008-11-12T16:27:13.59] --> total number of made checks = 1679852993
[2008-11-12T16:27:13.59] --> b4322869: test execution time = 12m. 0s
[2008-11-12T16:27:13.59] --> number of made checks for last time interval = 336385293
[2008-11-12T16:27:13.59] --> total number of made checks = 2016238286
[2008-11-12T16:27:13.59] ##> b4322869: FAILURE: loop terminated untimely!
[2008-11-12T16:27:13.59] ##> number of executed loop iterations = 2147483647
[2008-11-12T16:27:13.59] ==> nsk/regression/b4322869 test FAILED
[2008-11-12T16:27:13.59] # Test level exit status: 97
[2008-11-12T16:27:14.59]
Full logs:
http://vice.russia/gtee/1.4.2_17/b06/142_VM/80/vm/windows-amd64/windows-amd64_11D90AF9F79/Administrator.Windows_2003.amd64/b4322869/
Platform: windows-amd64 VM Arch: windows-amd64
Machine: STT-44 Info: Windows_NT STT-44 5 02 8664
JDK: Java(TM) 2 Runtime Environment, Standard Edition (build 1.4.2_17-b06)
VM: Java HotSpot(TM) 64-Bit Server VM (build 1.4.2_17-b06, mixed mode)
Testbase: VM 1.4.2
Suite: vm.full (tonga)
Options: -server -Xmixed
[2008-11-12T16:14:26.50] # Actual: C:/jdk/j2sdk1.4.2_17/windows-amd64/bin/java b4322869 20
[2008-11-12T16:14:26.50] ==> nsk/regression/b4322869 TEST LOG:
[2008-11-12T16:22:26.76] --> This test for #4322869 bug; Category: hotspot; Subcategory: compiler1
[2008-11-12T16:22:26.76] Synopsis: race condition when returning from native calls with oop result
[2008-11-12T16:22:26.76]
[2008-11-12T16:22:26.76] --> b4322869: test execution time limit = 18 minutes
[2008-11-12T16:22:26.76] --> b4322869: Thread "NativeOopThread" started
[2008-11-12T16:22:26.76] --> b4322869: test execution time = 2m. 0s
[2008-11-12T16:22:26.76] --> number of made checks for last time interval = 337720906
[2008-11-12T16:22:26.76] --> total number of made checks = 337720906
[2008-11-12T16:22:26.76] --> b4322869: test execution time = 4m. 0s
[2008-11-12T16:22:26.76] --> number of made checks for last time interval = 336850040
[2008-11-12T16:22:26.76] --> total number of made checks = 674570946
[2008-11-12T16:22:26.76] --> b4322869: test execution time = 6m. 0s
[2008-11-12T16:22:26.76] --> number of made checks for last time interval = 334840388
[2008-11-12T16:22:26.76] --> total number of made checks = 1009411334
[2008-11-12T16:22:26.76] --> b4322869: test execution time = 8m. 0s
[2008-11-12T16:22:26.76] --> number of made checks for last time interval = 335004917
[2008-11-12T16:22:26.76] --> total number of made checks = 1344416251
[2008-11-12T16:27:13.59] --> b4322869: test execution time = 10m. 0s
[2008-11-12T16:27:13.59] --> number of made checks for last time interval = 335436742
[2008-11-12T16:27:13.59] --> total number of made checks = 1679852993
[2008-11-12T16:27:13.59] --> b4322869: test execution time = 12m. 0s
[2008-11-12T16:27:13.59] --> number of made checks for last time interval = 336385293
[2008-11-12T16:27:13.59] --> total number of made checks = 2016238286
[2008-11-12T16:27:13.59] ##> b4322869: FAILURE: loop terminated untimely!
[2008-11-12T16:27:13.59] ##> number of executed loop iterations = 2147483647
[2008-11-12T16:27:13.59] ==> nsk/regression/b4322869 test FAILED
[2008-11-12T16:27:13.59] # Test level exit status: 97
[2008-11-12T16:27:14.59]
Full logs:
http://vice.russia/gtee/1.4.2_17/b06/142_VM/80/vm/windows-amd64/windows-amd64_11D90AF9F79/Administrator.Windows_2003.amd64/b4322869/