-
Bug
-
Resolution: Fixed
-
P3
-
7
-
b114
-
x86
-
linux_redhat_5.0
-
Verified
The regression test java/awt/Toolkit/ToolkitPropertyTest/ToolkitPropertyTest_Enable.java fails on RHEL5 with the following output on Jdk7 b55 pit build:
"java.lang.RuntimeException: TESTCASE 2 FAILED : button 8 wasn't single pressed|released|clicked : 0 : 0 : 0
at ToolkitPropertyTest_Enable.testCase2(ToolkitPropertyTest_Enable.java:107)"
Also failed with Jdk7 b49 build.
Attached is the .jtr file.
"java.lang.RuntimeException: TESTCASE 2 FAILED : button 8 wasn't single pressed|released|clicked : 0 : 0 : 0
at ToolkitPropertyTest_Enable.testCase2(ToolkitPropertyTest_Enable.java:107)"
Also failed with Jdk7 b49 build.
Attached is the .jtr file.