Uploaded image for project: 'JDK'
  1. JDK
  2. JDK-6847224

6u14 rev b09 build fails in deploy/plugin for both windows builds.

XMLWordPrintable

    • b09
    • generic
    • windows_2000

      Both windows builds failed, in the same spot in deploy/plugin code for 6u14 rev b09

      Only files changed from 6u14.

      6u14-rev-b09
      ------------
      Fixed 6804454: RFE: Provide a way to control the printing dpi resolution from MSIE browser print. See also 6801859
      update: src/plugin/share/classes/sun/plugin/PluginURLJarFileCallBack.java
      update: src/plugin/share/classes/sun/plugin/net/protocol/jar/CachedJarURLConnection.java
      update: src/plugin/win32/classes/sun/plugin2/main/client/PluginEmbeddedFrame.java

      http://jre.sfbay/net/mizu/n/mustang/j4b/jdk6_14/logs/build-windows-amd64.log
      http://jre.sfbay/net/mizu/n/mustang/j4b/jdk6_14/logs/build-windows-i586.log

      windows-amd64
      ============
      # Running javac:
      C:/BUILD_~1/jdk6_14/control/build/WINDOW~1/bin/javac -deprecation -source 1.4 -classpath C:/BUILD_~1/jdk6_14/control/build/WINDOW~1/classes;C:/BUILD_~1/jdk6_14/control/build/WINDOW~1/tmp/deploy/plugin/classes;C:/BUILD_~1/jdk6_14/control/build/WINDOW~1/tmp/deploy/deployClasses;C:/BUILD_~1/jdk6_14/control/build/WINDOW~1/tmp/deploy/javaws/jawsClasses -bootclasspath C:/BUILD_~1/jdk6_14/control/build/WINDOW~1/lib/jce.jar;C:/BUILD_~1/jdk6_14/control/build/WINDOW~1/lib/jsse.jar -sourcepath ../../../src/plugin/win32/classes;../../../src/plugin/share/classes -d C:/BUILD_~1/jdk6_14/control/build/WINDOW~1/tmp/deploy/plugin/classes -encoding ascii -source 1.4 -target 1.4 @C:/BUILD_~1/jdk6_14/control/build/WINDOW~1/tmp/deploy/plugin/.classes.list
      ..\..\..\src\plugin\share\classes\sun\plugin\AppletViewer.java:1297: warning: [deprecation] stop() in java.lang.ThreadGroup has been deprecated
                  group.stop();
                       ^
      ..\..\..\src\plugin\share\classes\netscape\javascript\JSObject.java:157: warning: [deprecation] EXCEPTION_TYPE_ERROR in netscape.javascript.JSException has been deprecated
              throw (JSException) new JSException(JSException.EXCEPTION_TYPE_ERROR, e).initCause(e);
                                                             ^
      ..\..\..\src\plugin\share\classes\netscape\javascript\JSObject.java:157: warning: [deprecation] JSException(int,java.lang.Object) in netscape.javascript.JSException has been deprecated
              throw (JSException) new JSException(JSException.EXCEPTION_TYPE_ERROR, e).initCause(e);
                                  ^
      ..\..\..\src\plugin\share\classes\sun\plugin2\applet\Applet2SecurityManager.java:123: warning: [deprecation] currentClassLoader() in java.lang.SecurityManager has been deprecated
          ClassLoader loader = currentClassLoader();
                               ^
      ..\..\..\src\plugin\win32\classes\sun\plugin2\main\client\PluginEmbeddedFrame.java:75: cannot find symbol
      symbol : method getPrintScaleFactor()
      location: class sun.plugin2.main.client.PluginEmbeddedFrame
              xscale = yscale = getPrintScaleFactor();
                                ^
      ..\..\..\src\plugin\share\classes\sun\plugin2\main\client\ModalityHelper.java:143: warning: [deprecation] getPeer() in java.awt.Component has been deprecated
                      hWnd = ((Long) getHWndMethod.invoke(dialog.getPeer(), null)).longValue();
                                                                ^
      ..\..\..\src\plugin\share\classes\sun\plugin\com\WrapperJSObject.java:56: warning: [deprecation] EXCEPTION_TYPE_EMPTY in netscape.javascript.JSException has been deprecated
                  throw new JSException(JSException.EXCEPTION_TYPE_EMPTY, (Object)e);
                                                   ^
      ..\..\..\src\plugin\share\classes\sun\plugin\com\WrapperJSObject.java:56: warning: [deprecation] JSException(int,java.lang.Object) in netscape.javascript.JSException has been deprecated
                  throw new JSException(JSException.EXCEPTION_TYPE_EMPTY, (Object)e);
                        ^
      1 error
      7 warnings
      gnumake[3]: *** [.compile.classlist] Error 1
      gnumake[3]: Leaving directory `C:/BUILD_AREA/jdk6_14/deploy/make/plugin/java'
      gnumake[2]: *** [java] Error 2
      gnumake[2]: Leaving directory `C:/BUILD_AREA/jdk6_14/deploy/make/plugin'
      gnumake[1]: *** [plugin-all] Error 2
      gnumake[1]: Leaving directory `C:/BUILD_AREA/jdk6_14/deploy/make'
      gnumake: *** [deploy-build] Error 2
      ## Windows AMD 64-bit local build finished on jb6-win-amd64




      windows-i586
      ==========
      # Running javac:
      C:/BUILD_~1/jdk6_14/control/build/WINDOW~1/bin/javac -deprecation -source 1.4 -classpath C:/BUILD_~1/jdk6_14/control/build/WINDOW~1/classes;C:/BUILD_~1/jdk6_14/control/build/WINDOW~1/tmp/deploy/plugin/classes;C:/BUILD_~1/jdk6_14/control/build/WINDOW~1/tmp/deploy/deployClasses;C:/BUILD_~1/jdk6_14/control/build/WINDOW~1/tmp/deploy/javaws/jawsClasses -bootclasspath C:/BUILD_~1/jdk6_14/control/build/WINDOW~1/lib/jce.jar;C:/BUILD_~1/jdk6_14/control/build/WINDOW~1/lib/jsse.jar -sourcepath ../../../src/plugin/win32/classes;../../../src/plugin/share/classes -d C:/BUILD_~1/jdk6_14/control/build/WINDOW~1/tmp/deploy/plugin/classes -encoding ascii -source 1.4 -target 1.4 @C:/BUILD_~1/jdk6_14/control/build/WINDOW~1/tmp/deploy/plugin/.classes.list
      ..\..\..\src\plugin\share\classes\sun\plugin\AppletViewer.java:1297: warning: [deprecation] stop() in java.lang.ThreadGroup has been deprecated
                  group.stop();
                       ^
      ..\..\..\src\plugin\share\classes\netscape\javascript\JSObject.java:157: warning: [deprecation] EXCEPTION_TYPE_ERROR in netscape.javascript.JSException has been deprecated
              throw (JSException) new JSException(JSException.EXCEPTION_TYPE_ERROR, e).initCause(e);
                                                             ^
      ..\..\..\src\plugin\share\classes\netscape\javascript\JSObject.java:157: warning: [deprecation] JSException(int,java.lang.Object) in netscape.javascript.JSException has been deprecated
              throw (JSException) new JSException(JSException.EXCEPTION_TYPE_ERROR, e).initCause(e);
                                  ^
      ..\..\..\src\plugin\share\classes\sun\plugin2\applet\Applet2SecurityManager.java:123: warning: [deprecation] currentClassLoader() in java.lang.SecurityManager has been deprecated
          ClassLoader loader = currentClassLoader();
                               ^
      ..\..\..\src\plugin\win32\classes\sun\plugin2\main\client\PluginEmbeddedFrame.java:75: cannot find symbol
      symbol : method getPrintScaleFactor()
      location: class sun.plugin2.main.client.PluginEmbeddedFrame
              xscale = yscale = getPrintScaleFactor();
                                ^
      ..\..\..\src\plugin\share\classes\sun\plugin2\main\client\ModalityHelper.java:143: warning: [deprecation] getPeer() in java.awt.Component has been deprecated
                      hWnd = ((Long) getHWndMethod.invoke(dialog.getPeer(), null)).longValue();
                                                                ^
      ..\..\..\src\plugin\share\classes\sun\plugin\com\WrapperJSObject.java:56: warning: [deprecation] EXCEPTION_TYPE_EMPTY in netscape.javascript.JSException has been deprecated
                  throw new JSException(JSException.EXCEPTION_TYPE_EMPTY, (Object)e);
                                                   ^
      ..\..\..\src\plugin\share\classes\sun\plugin\com\WrapperJSObject.java:56: warning: [deprecation] JSException(int,java.lang.Object) in netscape.javascript.JSException has been deprecated
                  throw new JSException(JSException.EXCEPTION_TYPE_EMPTY, (Object)e);
                        ^
      1 error
      7 warnings
      gnumake[3]: *** [.compile.classlist] Error 1
      gnumake[3]: Leaving directory `C:/BUILD_AREA/jdk6_14/deploy/make/plugin/java'
      gnumake[2]: *** [java] Error 2
      gnumake[2]: Leaving directory `C:/BUILD_AREA/jdk6_14/deploy/make/plugin'
      gnumake[1]: *** [plugin-all] Error 2
      gnumake[1]: Leaving directory `C:/BUILD_AREA/jdk6_14/deploy/make'
      gnumake: *** [deploy-build] Error 2
      ## Windows IA 32-bit local build finished on jb6-win-i586

            wrockett Walter Rockett (Inactive)
            katleman David Katleman (Inactive)
            Votes:
            0 Vote for this issue
            Watchers:
            0 Start watching this issue

              Created:
              Updated:
              Resolved:
              Imported:
              Indexed: