-
Bug
-
Resolution: Won't Fix
-
P3
-
None
-
7, 9
-
x86
-
windows_xp
The regresion testcase /java/awt/Choice/PopupPosTest/PopupPosTest.html failed on Windows Xp_ Prof on jdk7 b60 pit build and also jdk7 b59 build with the following output:
java.lang.RuntimeException: Test failed. Another item wasn't selected.
at TestFrame.<init>(PopupPosTest.java:73)
at PopupPosTest.start(PopupPosTest.java:18)
at com.sun.javatest.regtest.AppletWrapper$AppletThread.run(AppletWrapper.java:145)
at java.lang.Thread.run(Thread.java:717)
STATUS:Failed.Applet thread threw exception: java.lang.RuntimeException: Test failed. Another item wasn't selected.
result: Failed. Execution failed: Applet thread threw exception: java.lang.RuntimeException: Test failed. Another item wasn't selected.
Also attached is the .jtr file
java.lang.RuntimeException: Test failed. Another item wasn't selected.
at TestFrame.<init>(PopupPosTest.java:73)
at PopupPosTest.start(PopupPosTest.java:18)
at com.sun.javatest.regtest.AppletWrapper$AppletThread.run(AppletWrapper.java:145)
at java.lang.Thread.run(Thread.java:717)
STATUS:Failed.Applet thread threw exception: java.lang.RuntimeException: Test failed. Another item wasn't selected.
result: Failed. Execution failed: Applet thread threw exception: java.lang.RuntimeException: Test failed. Another item wasn't selected.
Also attached is the .jtr file