------------------------------------------------------------------------------
solaris_sparcv9_5.10-product (details from log file)
/net/prt-archiver.sfbay.sun.com/data/jprt/archive/2010/05/2010-05-28-131207.ab23780.jdk7-forest/logs/solaris_sparcv9_5.10-product.log
http://jprt-web.sfbay.sun.com/archive/2010/05/2010-05-28-131207.ab23780.jdk7-forest//logs/solaris_sparcv9_5.10-product.log
-Dclassanalyzer.debug \
-jar /tmp/jprt/P2/B/131207.ab23780/source/build/solaris-sparcv9/btjars/classanalyzer.jar
\
-jdkhome /tmp/jprt/P2/B/131207.ab23780/source/build/solaris-sparcv9 \
-config ../modules.config \
-config ../modules.group \
-depconfig ../jdk7.depconfig \
-depconfig ../optional.depconfig \
-base jdk.base \
-output /tmp/jprt/P2/B/131207.ab23780/source/build/solaris-sparcv9/tmp/modules/classlist
\
-moduleinfo /tmp/jprt/P2/B/131207.ab23780/source/build/solaris-sparcv9/tmp/modules/src
Error: no `client' JVM at
`/tmp/jprt/P2/B/131207.ab23780/source/build/solaris-sparcv9/lib/sparcv9/client/libjvm.so'.
gmake[4]: *** [gen-classlist] Error 4
gmake[4]: Leaving directory
`/tmp/jprt/P2/B/131207.ab23780/source/jdk/make/modules/tools'
gmake[3]: *** [gen-classlist] Error 2
gmake[3]: Leaving directory
`/tmp/jprt/P2/B/131207.ab23780/source/jdk/make/modules'
gmake[2]: *** [gen-modules] Error 2
gmake[2]: Leaving directory `/tmp/jprt/P2/B/131207.ab23780/source/jdk/make'
gmake[1]: *** [jdk-build] Error 2
gmake[1]: Leaving directory `/tmp/jprt/P2/B/131207.ab23780/source'
gmake: *** [build_product_image] Error 2
###########################################################
#
# pwd:
# /tmp/jprt/P2/B/131207.ab23780/source
#
# uname -a:
# SunOS jprt-sol-sparc-4 5.10 Generic_127127-11 sun4u sparc SUNW,Netra-T12
#
# df -k .:
# Filesystem kbytes used avail capacity Mounted on
# swap 26847376 6577856 20269520 25% /tmp
#
# Stats for ccache:
# cache directory
/opt/jprt/products/P2/ccache2.4/data_cache/SS12
# cache hit 927
# cache miss 94
# called for link 52
# multiple source files 723
# not a C/C++ file 48
# unsupported compiler option 6
# no input file 430
# files in cache 67415
# cache size 862.2 Mbytes
# max cache size 976.6 Mbytes
#
# Finished: Fri May 28 11:51:34 PDT 2010
#
# returned exit code 2
#
###########################################################
------------------------------------------------------------------------------
solaris_sparcv9_5.10-product (details from log file)
/net/prt-archiver.sfbay.sun.com/data/jprt/archive/2010/05/2010-05-28-131207.ab23780.jdk7-forest/logs/solaris_sparcv9_5.10-product.log
http://jprt-web.sfbay.sun.com/archive/2010/05/2010-05-28-131207.ab23780.jdk7-forest//logs/solaris_sparcv9_5.10-product.log
-Dclassanalyzer.debug \
-jar /tmp/jprt/P2/B/131207.ab23780/source/build/solaris-sparcv9/btjars/classanalyzer.jar
\
-jdkhome /tmp/jprt/P2/B/131207.ab23780/source/build/solaris-sparcv9 \
-config ../modules.config \
-config ../modules.group \
-depconfig ../jdk7.depconfig \
-depconfig ../optional.depconfig \
-base jdk.base \
-output /tmp/jprt/P2/B/131207.ab23780/source/build/solaris-sparcv9/tmp/modules/classlist
\
-moduleinfo /tmp/jprt/P2/B/131207.ab23780/source/build/solaris-sparcv9/tmp/modules/src
Error: no `client' JVM at
`/tmp/jprt/P2/B/131207.ab23780/source/build/solaris-sparcv9/lib/sparcv9/client/libjvm.so'.
gmake[4]: *** [gen-classlist] Error 4
gmake[4]: Leaving directory
`/tmp/jprt/P2/B/131207.ab23780/source/jdk/make/modules/tools'
gmake[3]: *** [gen-classlist] Error 2
gmake[3]: Leaving directory
`/tmp/jprt/P2/B/131207.ab23780/source/jdk/make/modules'
gmake[2]: *** [gen-modules] Error 2
gmake[2]: Leaving directory `/tmp/jprt/P2/B/131207.ab23780/source/jdk/make'
gmake[1]: *** [jdk-build] Error 2
gmake[1]: Leaving directory `/tmp/jprt/P2/B/131207.ab23780/source'
gmake: *** [build_product_image] Error 2
###########################################################
#
# pwd:
# /tmp/jprt/P2/B/131207.ab23780/source
#
# uname -a:
# SunOS jprt-sol-sparc-4 5.10 Generic_127127-11 sun4u sparc SUNW,Netra-T12
#
# df -k .:
# Filesystem kbytes used avail capacity Mounted on
# swap 26847376 6577856 20269520 25% /tmp
#
# Stats for ccache:
# cache directory
/opt/jprt/products/P2/ccache2.4/data_cache/SS12
# cache hit 927
# cache miss 94
# called for link 52
# multiple source files 723
# not a C/C++ file 48
# unsupported compiler option 6
# no input file 430
# files in cache 67415
# cache size 862.2 Mbytes
# max cache size 976.6 Mbytes
#
# Finished: Fri May 28 11:51:34 PDT 2010
#
# returned exit code 2
#
###########################################################
------------------------------------------------------------------------------