-
Bug
-
Resolution: Fixed
-
P2
-
7
-
b100
-
x86
-
solaris_10
-
Verified
Testsuite name: regression
test: java/awt/FileDialog/FilenameFilterTest/FilenameFilterTest.html
JDK/JRE tested: 7b94
OS/architecture: amd64-solaris10
Reproducible: Always
Reproducible on machine: stt-12.russia
Is it a platform specific regression: N
Is it a Regression: Y
test failed on b94, but passed on b93
Regression introduced in release/build: b94
Test run log location:
stt-robot@stt12:/export/JQA/regression/7b94/cur2/work/java/awt/FileDialog/FilenameFilterTest/FilenameFilterTest.jtr
----------messages:(3/136)----------
command: applet FilenameFilterTest.html
reason: User specified action: run applet FilenameFilterTest.html
elapsed time (seconds): 2.22
----------System.out:(0/0)----------
----------System.err:(5/330)----------
java.lang.RuntimeException: Filter was not called
at FilenameFilterTest.start(FilenameFilterTest.java:88)
at com.sun.javatest.regtest.AppletWrapper$AppletRunnable.run(AppletWrapper.java:153)
at java.lang.Thread.run(Thread.java:717)
STATUS:Failed.Applet thread threw exception: java.lang.RuntimeException: Filter was not called
result: Failed. Execution failed: Applet thread threw exception: java.lang.RuntimeException: Filter was not called
test result: Failed. Execution failed: Applet thread threw exception: java.lang.RuntimeException: Filter was not called
Steps to reproduce:
[stt-robot@stt-12]$ /export/jdk/jdk1.6.0_21b05_j4b/bin/java -jar /net/vice/export/home0/regression/tools/jtest-latest/lib/jtreg.jar -testjdk:/export/jdk/7b94/jdk1.7.0/ /net/vice/export/home0/regression/workspaces/170/1.7.0b96/j2se/test/java/awt/FileDialog/FilenameFilterTest/FilenameFilterTest.html
Directory "JTreport" not found: creating
Directory "JTwork" not found: creating
Directory "JTwork/scratch" not found: creating
Test results: failed: 1
Report written to JTreport/report.html
Results written to /export/JQA/regression/7b94/JTwork
Error: Some tests failed or other problems occurred.
test: java/awt/FileDialog/FilenameFilterTest/FilenameFilterTest.html
JDK/JRE tested: 7b94
OS/architecture: amd64-solaris10
Reproducible: Always
Reproducible on machine: stt-12.russia
Is it a platform specific regression: N
Is it a Regression: Y
test failed on b94, but passed on b93
Regression introduced in release/build: b94
Test run log location:
stt-robot@stt12:/export/JQA/regression/7b94/cur2/work/java/awt/FileDialog/FilenameFilterTest/FilenameFilterTest.jtr
----------messages:(3/136)----------
command: applet FilenameFilterTest.html
reason: User specified action: run applet FilenameFilterTest.html
elapsed time (seconds): 2.22
----------System.out:(0/0)----------
----------System.err:(5/330)----------
java.lang.RuntimeException: Filter was not called
at FilenameFilterTest.start(FilenameFilterTest.java:88)
at com.sun.javatest.regtest.AppletWrapper$AppletRunnable.run(AppletWrapper.java:153)
at java.lang.Thread.run(Thread.java:717)
STATUS:Failed.Applet thread threw exception: java.lang.RuntimeException: Filter was not called
result: Failed. Execution failed: Applet thread threw exception: java.lang.RuntimeException: Filter was not called
test result: Failed. Execution failed: Applet thread threw exception: java.lang.RuntimeException: Filter was not called
Steps to reproduce:
[stt-robot@stt-12]$ /export/jdk/jdk1.6.0_21b05_j4b/bin/java -jar /net/vice/export/home0/regression/tools/jtest-latest/lib/jtreg.jar -testjdk:/export/jdk/7b94/jdk1.7.0/ /net/vice/export/home0/regression/workspaces/170/1.7.0b96/j2se/test/java/awt/FileDialog/FilenameFilterTest/FilenameFilterTest.html
Directory "JTreport" not found: creating
Directory "JTwork" not found: creating
Directory "JTwork/scratch" not found: creating
Test results: failed: 1
Report written to JTreport/report.html
Results written to /export/JQA/regression/7b94/JTwork
Error: Some tests failed or other problems occurred.
- relates to
-
JDK-6913179 The java.awt.FileDialog should use native GTK file chooser on linux distros
-
- Closed
-
-
JDK-4031440 FileDialog doesn't call FilenameFilter.accept()
-
- Closed
-