Uploaded image for project: 'JDK'
  1. JDK
  2. JDK-6978409

sun/java2d/DirectX/OnScreenRenderingResizeTest/OnScreenRenderingResizeTest.java fails

XMLWordPrintable

    • Icon: Bug Bug
    • Resolution: Duplicate
    • Icon: P3 P3
    • None
    • 7
    • client-libs
    • 2d
    • generic
    • linux

      Testsuite name: j2se regression

      test: sun/java2d/DirectX/OnScreenRenderingResizeTest/OnScreenRenderingResizeTest.java

      JDK/JRE tested: 7b105

      OS/architecture: linux-x86, linux-amd64

      Reproducible: Always

      Reproducible on machine: stt-28.russia

      Is it a platform specific regression: N

      Is it a Regression: N

      Test run log location:
      [stt-robot@stt-28]$ cat cur/work/sun/java2d/DirectX/OnScreenRenderingResizeTest/OnScreenRenderingResizeTest.jtr
      #Test Results (version 2)
      #Thu Aug 19 17:16:53 MSD 2010
      #checksum:50a2029b0bd705b8
      #-----testdescription-----
      $file=/net/vice/export/stt/newroot/regression/workspaces/170/1.7.0_fcsb105/j2se/test/sun/java2d/DirectX/OnScreenRenderingResizeTest/OnScreenRenderingResizeTest.java
      $root=/net/vice/export/stt/newroot/regression/workspaces/170/1.7.0_fcsb105/j2se/test
      author=###@###.###: area=Graphics
      keywords=bug6664068 bug6666931 othervm
      run=USER_SPECIFIED main/othervm OnScreenRenderingResizeTest\nUSER_SPECIFIED main/othervm -Dsun.java2d.d3d=false OnScreenRenderingResizeTest\n
      source=OnScreenRenderingResizeTest.java
      title=Tests that resizing a window to which a tight loop is rendering doesn't produce artifacts or crashes

      #-----environment-----

      #-----testresult-----
      description=file:///net/vice/export/stt/newroot/regression/workspaces/170/1.7.0_fcsb105/j2se/test/sun/java2d/DirectX/OnScreenRenderingResizeTest/OnScreenRenderingResizeTest.java
      end=Thu Aug 19 17:16:53 MSD 2010
      environment=regtest
      execStatus=Failed. Execution failed: `main' threw exception: java.lang.RuntimeException: Test failed at 0-0 rgb=0xff3d3d3b
      javatestOS=Linux 2.6.32-22-generic (amd64)
      javatestVersion=3.2.2_03
      script=com.sun.javatest.regtest.RegressionScript
      sections=script_messages build main
      start=Thu Aug 19 17:16:50 MSD 2010
      test=sun/java2d/DirectX/OnScreenRenderingResizeTest/OnScreenRenderingResizeTest.java
      work=/export/jdk/7b105/cur/work/sun/java2d/DirectX/OnScreenRenderingResizeTest

      #section:script_messages
      ----------messages:(4/186)----------
      JDK under test: (/export/jdk/7b105/jdk1.7.0)
      java version "1.7.0-ea"
      Java(TM) SE Runtime Environment (build 1.7.0-ea-b105)
      Java HotSpot(TM) 64-Bit Server VM (build 19.0-b05, mixed mode)

      #section:build
      ----------messages:(3/112)----------
      command: build OnScreenRenderingResizeTest
      reason: Named class compiled on demand
      elapsed time (seconds): 0.002
      result: Passed. All files up to date

      #section:main
      ----------messages:(3/149)----------
      command: main OnScreenRenderingResizeTest
      reason: User specified action: run main/othervm OnScreenRenderingResizeTest
      elapsed time (seconds): 2.927
      ----------System.out:(1/50)----------
      Screen shot file: OnScreenRenderingResizeTest.png
      ----------System.err:(14/864)----------
      java.lang.RuntimeException: Test failed at 0-0 rgb=0xff3d3d3b
      at OnScreenRenderingResizeTest.checkBI(OnScreenRenderingResizeTest.java:202)
      at OnScreenRenderingResizeTest.main(OnScreenRenderingResizeTest.java:165)
      at sun.reflect.NativeMethodAccessorImpl.invoke0(Native Method)
      at sun.reflect.NativeMethodAccessorImpl.invoke(NativeMethodAccessorImpl.java:57)
      at sun.reflect.DelegatingMethodAccessorImpl.invoke(DelegatingMethodAccessorImpl.java:43)
      at java.lang.reflect.Method.invoke(Method.java:613)
      at com.sun.javatest.regtest.MainWrapper$MainThread.run(MainWrapper.java:96)
      at java.lang.Thread.run(Thread.java:717)

      JavaTest Message: Test threw exception: java.lang.RuntimeException: Test failed at 0-0 rgb=0xff3d3d3b
      JavaTest Message: shutting down test

      STATUS:Failed.`main' threw exception: java.lang.RuntimeException: Test failed at 0-0 rgb=0xff3d3d3b
      result: Failed. Execution failed: `main' threw exception: java.lang.RuntimeException: Test failed at 0-0 rgb=0xff3d3d3b


      test result: Failed. Execution failed: `main' threw exception: java.lang.RuntimeException: Test failed at 0-0 rgb=0xff3d3d3b

      Steps to reproduce:
      [stt-robot@stt-28]$ ./jdk1.7.0/bin/javac OnScreenRenderingResizeTest.java
      [stt-robot@stt-28]$ ./jdk1.7.0/bin/java OnScreenRenderingResizeTest
      Screen shot file: OnScreenRenderingResizeTest.png
      Exception in thread "main" java.lang.RuntimeException: Test failed at 0-0 rgb=0xff3d3d3b
      at OnScreenRenderingResizeTest.checkBI(OnScreenRenderingResizeTest.java:202)
      at OnScreenRenderingResizeTest.main(OnScreenRenderingResizeTest.java:165)

            bae Andrew Brygin
            ikobzaresunw Ivan Kobzarev (Inactive)
            Votes:
            0 Vote for this issue
            Watchers:
            0 Start watching this issue

              Created:
              Updated:
              Resolved:
              Imported:
              Indexed: