-
Bug
-
Resolution: Unresolved
-
P3
-
6, 7, 8, 9, 11, 12, 13, 14, 15, 16, 17
Bug description: When ContainerOrderFocusTraversalPolicy is set for the Container, the focus traversalcycle does not iterate across the Componentsin a focus traversal cycle in the order in which they were added to their Containers.
Testsuite name: AWT
JDK/JRE tested: jdk-7-ea-bin-b94-windows-i586-27_may_2010.exe
OS/architecture: win2008 x86
Reproducible: Always
Actual behavior:
The case failed atuomatically for the reason:
java.lang.RuntimeException: TEST FAILED: eWhen ContainerOrderFocusTraversalPolicy isset for the Container, the focus traversalcycle does not iterate across the Components in a focus traversal cycle in the order inwhich they were added to their Containers.
at javasoft.awtsqe.RobotAppletTest.destroy(Unknown Source)
at com.sun.javatest.regtest.AppletWraINSTRUCTIONS: This is an AUTOMATIC test simply wait until it is done.
firstbutton has focusfalse
The following cases has this issue:
AWT_Focus/Automated/AWT/SetTraversalPolicyTest/SetTraversalPolicyTest
AWT_Focus/Automated/Lw/SetTraversalPolicyTest/SetTraversalPolicyTest
AWT_Focus/Automated/Mw/SetTraversalPolicyTest/SetTraversalPolicyTest
AWT_Focus/Automated/Swing/SetTraversalPolicyTest/SetTraversalPolicyTest
validation:
For jdk7b94, it fails over oel5.5-i586
For jdk7b95, it fails over winvista-i586 and rhel5-i586
For jdk6u21b04 it passed.
Testsuite name: AWT
JDK/JRE tested: jdk-7-ea-bin-b94-windows-i586-27_may_2010.exe
OS/architecture: win2008 x86
Reproducible: Always
Actual behavior:
The case failed atuomatically for the reason:
java.lang.RuntimeException: TEST FAILED: eWhen ContainerOrderFocusTraversalPolicy isset for the Container, the focus traversalcycle does not iterate across the Components in a focus traversal cycle in the order inwhich they were added to their Containers.
at javasoft.awtsqe.RobotAppletTest.destroy(Unknown Source)
at com.sun.javatest.regtest.AppletWraINSTRUCTIONS: This is an AUTOMATIC test simply wait until it is done.
firstbutton has focusfalse
The following cases has this issue:
AWT_Focus/Automated/AWT/SetTraversalPolicyTest/SetTraversalPolicyTest
AWT_Focus/Automated/Lw/SetTraversalPolicyTest/SetTraversalPolicyTest
AWT_Focus/Automated/Mw/SetTraversalPolicyTest/SetTraversalPolicyTest
AWT_Focus/Automated/Swing/SetTraversalPolicyTest/SetTraversalPolicyTest
validation:
For jdk7b94, it fails over oel5.5-i586
For jdk7b95, it fails over winvista-i586 and rhel5-i586
For jdk6u21b04 it passed.