-
Bug
-
Resolution: Unresolved
-
P4
-
6, 7, 8, 9, 10, 11, 12, 13, 14, 15, 16, 17, 18, 19, 20, 21
-
generic, x86
-
generic, windows_2008
Bug description: When a Key is set as an Down Cycle traversal key the key does not generate downcycle traversal for every each component
Testsuite name: AWT
JDK/JRE tested: jdk-7-ea-bin-b94-windows-i586-27_may_2010.exe
OS/architecture: win2008 x86
Reproducible: Always
Actual behavior:
The case failed atuomatically for the reason:
java.lang.RuntimeException: TEST FAILED: When a Key is set as an Up Cycle traversal keythe key does not generate up cycle traversal for every each component: When a Key is set as an Down Cycle traversal key the key does not generate downcycle traversal for every each component
at javasoft.awtsqe.RobotAppletTest.destroy(Unknown Source)
at com.sun.javatest.regtest.AppletWrapper$AppletThread.run(AppletWrapper.java:95)
at java.lang.Thread.run(Thread.java:717)
STATUS:Failed.Applet thread threw exception: java.lang.RuntimeException: TEST FAILED: When a Key is set as an Up Cycle traversal keythe key does not generate up cycle traversal for every each component: When a Key is set as an Down Cycle traversal key the key does not generate downcycle traversal for every each component
The following cases has this issue:
AWT_Focus/Automated/AWT/FocusCycleTest/FocusCycleTest
AWT_Focus/Automated/Swing/FocusCycleTest/FocusCycleTest
validation:
For jdk7b94, it fails over oel5.5-i586
For jdk7b95, it fails over winvista-i586 and rhel5-i586
For jdk6u21b04 it passed.
Testsuite name: AWT
JDK/JRE tested: jdk-7-ea-bin-b94-windows-i586-27_may_2010.exe
OS/architecture: win2008 x86
Reproducible: Always
Actual behavior:
The case failed atuomatically for the reason:
java.lang.RuntimeException: TEST FAILED: When a Key is set as an Up Cycle traversal keythe key does not generate up cycle traversal for every each component: When a Key is set as an Down Cycle traversal key the key does not generate downcycle traversal for every each component
at javasoft.awtsqe.RobotAppletTest.destroy(Unknown Source)
at com.sun.javatest.regtest.AppletWrapper$AppletThread.run(AppletWrapper.java:95)
at java.lang.Thread.run(Thread.java:717)
STATUS:Failed.Applet thread threw exception: java.lang.RuntimeException: TEST FAILED: When a Key is set as an Up Cycle traversal keythe key does not generate up cycle traversal for every each component: When a Key is set as an Down Cycle traversal key the key does not generate downcycle traversal for every each component
The following cases has this issue:
AWT_Focus/Automated/AWT/FocusCycleTest/FocusCycleTest
AWT_Focus/Automated/Swing/FocusCycleTest/FocusCycleTest
validation:
For jdk7b94, it fails over oel5.5-i586
For jdk7b95, it fails over winvista-i586 and rhel5-i586
For jdk6u21b04 it passed.